program: Gaussian 09
title: 000028892
version: EM64L-G09RevD.01
frameworkgroup: C1[X(C18H29NO3)]
method: RPBEPBE
basis: SDD
operation: Freq
keyword: #p
keyword: freq=noraman
keyword: PBEPBE/SDD
title: #p freq=noraman PBEPBE/SDD
converged: YES YES NO NO
title: Mulliken charges:
elementType: O O O N C C C C C C C C C C C C C C C C C C H H H H H H H H H H H H H H H H H H H H H H H H H H H H H
charge: -0.269666 -0.254399 -0.249942 -0.112412 -0.340545 -0.386406 -0.383963 -0.327000 -0.323273 -0.252471 0.482353 0.233713 -0.239030 -0.691864 -0.671437 -0.672035 -0.268345 -0.435214 -0.377584 -0.224123 -0.235120 -0.244048 0.233330 0.221651 0.211327 0.229078 0.207391 0.204779 0.190155 0.203338 0.189529 0.207815 0.181270 0.201100 0.183710 0.205067 0.218513 0.236987 0.206153 0.225093 0.208582 0.205771 0.225388 0.212287 0.217421 0.247378 0.232324 0.261405 0.224350 0.224499 0.227121
chargesum: 0.00000
title: Mulliken charges with hydrogens summed into heavy atoms:
elementType: O O O N C C C C C C C C C C C C C C C C C C
charge: -0.269666 -0.254399 -0.249942 -0.112412 -0.107215 0.046572 0.052506 0.067935 0.069594 0.136615 0.482353 0.233713 0.145779 -0.031297 -0.031609 -0.028590 0.196454 -0.202891 -0.116179 0.000227 -0.010621 -0.016927
polarizability: 2.24857237e+02 -2.96388956e+00 2.24691449e+02 1.29574390e+01 -8.95090877e-01 1.82842169e+02
1716.lowfreq: -11.9329 -6.4009 -4.8056 -0.0009 -0.0008 0.0004 6.5214 9.4460 15.0619
frequency: -10.3739 9.3949 14.7904 25.4244 38.3502 46.6354 60.4911 64.7484 85.6360 87.7339 93.7082 103.7378 116.4174 135.4414 144.9203 175.4028 193.9129 194.5985 213.6968 226.6757 247.6389 261.1456 278.9445 283.8104 300.8001 324.8370 346.2963 359.6922 398.4648 404.4560 411.7956 443.0816 490.7669 505.9085 514.8779 572.5579 614.7690 696.0932 703.8538 721.4812 740.8117 743.9048 775.9846 794.7206 797.0197 803.9958 810.8497 839.9562 843.0533 855.6057 894.2310 914.5102 919.7485 953.9393 977.9970 987.5759 990.1202 995.6778 998.8303 1013.5983 1025.3014 1039.7360 1050.8060 1065.0185 1070.4805 1074.9308 1076.3242 1082.8051 1084.8895 1095.1996 1106.2245 1113.9802 1125.3306 1126.6380 1160.2981 1171.6997 1189.9053 1195.5384 1199.4176 1207.9105 1229.7605 1237.7366 1248.8443 1276.6218 1285.7118 1286.9928 1289.7600 1300.8231 1319.3767 1334.4645 1342.3062 1354.2964 1362.1199 1365.7537 1375.3573 1384.3870 1386.4581 1387.5382 1389.4231 1410.8468 1442.1384 1451.3479 1458.6087 1461.7291 1463.5812 1465.9826 1470.7826 1476.2571 1476.3600 1481.0117 1481.1448 1484.0272 1486.5360 1488.2773 1491.5524 1592.9435 1609.7808 1628.6827 2852.3786 2861.8627 2908.7725 2917.9949 2927.4770 2976.6314 2978.1545 2982.4059 2982.8914 2988.7145 2988.9857 3019.7297 3021.6416 3029.2956 3033.5367 3048.9638 3060.6422 3074.2963 3074.9324 3076.2738 3084.7883 3088.6460 3090.9427 3091.2257 3118.9000 3125.4975 3137.4866 3147.6759 3162.8190
redmass: 4.7731 3.3863 3.9558 5.2484 4.1054 3.4472 2.8078 2.7841 2.2935 2.6555 2.9311 3.7040 3.1034 3.3868 2.0855 2.4373 1.5808 2.4783 1.9828 2.0240 1.4104 2.4525 1.9560 2.4842 2.5873 4.9601 3.4727 3.2204 2.9892 2.8372 3.3218 2.7347 2.7259 3.7613 2.9816 3.3644 6.3943 7.7358 2.0830 2.3216 2.5621 2.2720 2.3226 1.1855 1.1324 1.3975 1.8505 2.4300 2.2654 1.2457 2.2151 1.8803 1.6715 3.1325 1.4009 2.2359 4.7380 1.4062 3.7551 2.4518 2.2639 1.8505 2.7289 1.7656 2.7253 1.8378 1.8532 1.9062 2.1827 3.1755 2.6000 2.2174 2.4791 1.8419 1.3730 1.0599 1.1162 2.4672 1.1202 2.2477 1.7091 1.3380 1.1049 1.1144 1.4915 1.2475 1.2407 1.2564 1.2722 1.3775 1.3327 1.3956 1.3410 1.3919 1.4375 5.9252 1.2355 1.2334 1.2253 1.5418 2.1346 1.0825 1.0754 1.0611 1.0531 1.0784 1.0577 1.0634 1.0458 1.7921 1.1340 1.1075 1.0707 1.0766 1.0777 6.0885 6.0737 9.3818 1.0719 1.0715 1.0703 1.0585 1.0592 1.1000 1.0363 1.0357 1.0358 1.0616 1.1012 1.0596 1.0876 1.0873 1.0874 1.0968 1.0919 1.0992 1.0985 1.0980 1.1005 1.1063 1.1003 1.1003 1.0854 1.0872 1.0919 1.0962 1.1016
irintensity: 0.0078 0.0688 0.0859 1.1973 0.2877 0.0576 0.5375 0.2784 1.2397 0.8307 1.3400 2.7103 2.0353 3.2256 2.6992 1.8526 0.0827 4.4513 0.9843 2.1997 1.2854 1.2165 0.7454 6.4373 3.6235 5.8091 1.1193 0.1766 8.8389 0.0811 3.5936 5.5987 6.8613 9.3745 6.2743 6.2925 0.0524 1.0830 32.2529 46.9919 17.4646 4.7382 27.6244 7.0466 3.6427 7.6427 5.9865 5.9908 5.4987 0.1833 1.1597 0.6002 13.2724 14.3373 0.1269 9.5250 0.2684 1.7803 92.8873 50.7846 8.6284 21.8338 16.1834 24.8348 144.6817 9.8499 28.6499 6.4141 2.4129 17.3614 119.6650 21.7827 213.6649 17.9750 4.7839 0.5185 0.0288 3.5263 4.4437 31.3773 20.6229 3.4003 5.1318 0.7732 103.7162 10.7209 25.6307 13.2597 9.0851 7.9992 13.2064 4.8899 3.1532 0.4600 9.2706 0.9883 20.5914 23.3431 13.6320 1.1083 13.1171 12.0765 9.3744 15.2734 5.2202 5.5512 2.5343 0.2713 11.5633 10.6409 11.5488 13.4567 9.8995 14.5143 7.9465 3.3250 14.8770 147.3268 35.3173 159.8596 71.3741 35.9812 112.1412 46.8734 31.3057 38.2791 24.0837 28.5440 42.8242 28.4327 18.2127 3.9940 19.9594 9.4386 30.4611 50.7209 36.8019 79.5223 47.5049 20.1983 31.3071 54.6818 4.6048 0.9075 19.8973 29.5103 23.5701
temp: 298.150 k
press: 1.00000 atm
elementType: 8 8 8 7 6 6 6 6 6 6 6 6 6 6 6 6 6 6 6 6 6 6 1 1 1 1 1 1 1 1 1 1 1 1 1 1 1 1 1 1 1 1 1 1 1 1 1 1 1 1 1
symmnumber: 1
zpe: 1149374.7 jmol-1
zpe.correction: 0.437774 hartree
zpe.thermalcorrener: 0.462342 hartree
zpe.thermalcorrenthalpy: 0.463286 hartree
zpe.thermalcorrgfe: 0.379013 hartree
zpe.sumelectzpe: -981.973073 hartree
zpe.sumelectthermal: -981.948505 hartree
zpe.sumelectthermalent: -981.947560 hartree
zpe.sumelectthermalfe: -982.031834 hartree
dipole: 2.1655 0.0718 1.2115
dipole: 2.4824
quadrupole: -128.8292 -124.3589 -133.6945
quadrupole: -5.1573 -4.9801 -3.2578
quadrupole: 0.1316 4.6020 -4.7337 -5.1573 -4.9801 -3.2578
hfenergy: -982.4108466 hartree
pointgroup: C01 [X(C18H29N1O3)]
dipole: -0.8859873 -0.3404113 0.23027 debye
polarizability: 227.5958447|3.2207532|207.8031208|-8.486085|20.9840576|196.9918903 unknown
InChI: InChI=1S/C18H29NO3/c1-4-17(16-10-8-7-9-11-16)18(20)22-15-14-21-13-12-19(5-2)6-3/h7-11,17H,4-6,12-15H2,1-3H3
charge 0 multiplicity 1
51 atoms
O  -2.247584 1.253267 0.221423
O  0.497963 1.193051 1.446097
O  2.384714 2.517647 1.118401
N  -5.31865 -0.584079 -0.877062
C  2.640241 0.094323 1.592853
C  -3.939855 -0.034293 -0.925177
C  3.768652 0.343373 2.641646
C  -6.344424 0.406872 -1.302227
C  -5.45335 -1.897115 -1.561938
C  -3.597464 0.695627 0.38113
C  3.183465 -0.444737 0.261889
C  1.875173 1.396565 1.356633
C  -1.79988 1.983977 1.405241
C  4.513697 -0.947808 3.034412
C  -7.730751 0.141574 -0.684215
C  -4.841794 -3.057968 -0.754578
C  -0.352895 2.39334 1.197028
C  2.835098 -1.74678 -0.17425
C  4.05634 0.336679 -0.539334
C  3.353904 -2.26647 -1.382466
C  4.57343 -0.180464 -1.747206
C  4.226869 -1.484638 -2.172677
H  1.92264 -0.639377 2.00168
H  -3.216031 -0.857394 -1.055667
H  -3.787896 0.663358 -1.781927
H  4.475598 1.087396 2.230374
H  3.317792 0.802718 3.543478
H  -6.00028 1.406973 -0.977781
H  -6.429255 0.452521 -2.4181
H  -6.531898 -2.095813 -1.699102
H  -5.003572 -1.870899 -2.587044
H  -3.62865 -0.017845 1.23163
H  -4.328402 1.510396 0.585434
H  -1.891158 1.356664 2.318666
H  -2.420943 2.898163 1.54741
H  3.823728 -1.689705 3.479391
H  5.300932 -0.731044 3.779143
H  4.994196 -1.41633 2.157216
H  -8.450512 0.920629 -0.998409
H  -7.660662 0.144163 0.417518
H  -8.140692 -0.836249 -0.99552
H  -4.976804 -4.016025 -1.290874
H  -5.329326 -3.13162 0.233131
H  -3.75813 -2.917137 -0.589407
H  -0.049827 3.190746 1.899794
H  -0.185094 2.744595 0.164079
H  2.153578 -2.354874 0.433057
H  4.311025 1.355175 -0.22416
H  3.075725 -3.276068 -1.705736
H  5.242852 0.434791 -2.359247
H  4.62887 -1.884353 -3.110547
