program: Gaussian 09
title: 000028878
version: EM64L-G09RevD.01
frameworkgroup: C1[X(C10H13NO4)]
method: RPBEPBE
basis: SDD
operation: Freq
keyword: #p
keyword: freq=noraman
keyword: PBEPBE/SDD
title: #p freq=noraman PBEPBE/SDD
converged: YES YES NO NO
title: Mulliken charges:
elementType: O O O O N C C C C C C C C C C H H H H H H H H H H H H H
charge: -0.281431 -0.337224 -0.246629 -0.283702 -0.374782 0.367834 0.384810 -0.466516 -0.388354 -0.433526 -0.165538 -0.203403 0.299449 -0.606892 -0.510061 0.318817 0.251843 0.252605 0.229631 0.198122 0.243981 0.332892 0.272231 0.232228 0.231759 0.201690 0.244114 0.236051
chargesum: 0.00000
title: Mulliken charges with hydrogens summed into heavy atoms:
elementType: O O O O N C C C C C C C C C C
charge: -0.281431 -0.337224 -0.246629 -0.283702 -0.041890 0.367834 0.384810 -0.147699 -0.136511 -0.180921 0.064093 0.238701 0.299449 0.129326 0.171794
polarizability: 1.85092539e+02 2.80346873e+00 1.47820914e+02 -1.79351667e+00 3.98206038e+00 6.99125762e+01
1716.lowfreq: -6.0509 -4.9897 -0.0008 -0.0001 0.0002 4.5312 25.9369 32.2335 42.4316
frequency: 25.8827 32.1343 42.4170 59.6181 79.4516 98.8800 142.7244 146.8378 159.7173 174.8030 232.0964 239.6336 269.6106 315.0470 322.9236 351.2728 411.2159 447.5462 467.2438 585.0779 594.3062 596.3491 602.8302 671.8808 682.4890 688.0000 744.0134 784.2364 858.3135 876.2096 878.2783 883.2475 894.1331 958.3366 965.6842 981.2227 1060.2038 1076.2925 1087.5005 1103.3948 1121.7870 1126.9301 1133.7953 1149.7616 1158.8426 1166.7441 1198.7641 1248.2864 1254.0112 1298.1573 1374.8278 1388.8156 1428.5099 1430.5630 1432.4614 1454.4346 1457.7153 1464.2313 1477.7770 1480.6868 1484.1665 1513.7354 1595.4127 1609.3139 1685.5906 2920.0327 2956.8733 2982.5182 3061.0554 3062.2446 3064.5126 3115.5008 3126.6453 3142.6839 3170.6248 3180.8655 3203.5813 3577.7287
redmass: 5.4934 3.4153 4.2756 4.2324 3.9743 1.0957 3.5482 1.3089 3.3537 2.4917 6.3074 5.1438 5.1084 3.7908 5.4286 5.4756 3.1863 3.1196 4.2881 1.4313 7.0970 2.7210 5.6017 7.3045 4.4834 3.0466 6.5574 1.4681 6.0743 1.4634 3.4774 1.6464 6.5238 4.3911 1.3151 6.1025 1.6416 1.6380 3.1476 1.7938 1.7881 1.2832 1.9274 1.6697 1.5064 1.2327 2.2220 1.5092 2.5973 1.3110 1.2648 5.8772 1.3864 1.3406 1.7036 1.0542 1.3674 1.1320 1.4319 1.4297 1.0436 1.3856 6.2565 7.3410 9.0684 1.0635 1.0378 1.0354 1.1027 1.1000 1.0958 1.0983 1.1022 1.0875 1.0926 1.0986 1.0922 1.0773
irintensity: 6.9569 1.3034 2.7169 2.1277 0.7676 0.2425 4.1545 2.8564 1.4498 7.8483 1.4288 0.2969 9.3429 5.4676 0.9732 22.6946 4.5161 2.3178 5.6250 94.7968 1.1911 35.4087 3.5988 6.6653 1.0889 56.0197 4.7448 58.1221 43.9845 20.2365 48.0281 8.5804 190.8403 190.2444 1.9030 11.0317 68.2477 17.4596 191.1163 125.3418 228.8809 0.1099 251.8854 1.4699 23.7342 40.6573 268.9078 44.3301 137.9585 13.8508 42.5712 15.1376 47.2702 26.5095 29.7117 7.6156 234.2758 3.8354 115.7623 22.3408 15.8637 169.9257 137.9726 67.8316 268.6917 54.1907 60.4232 81.9378 33.3853 31.7327 39.0263 3.7404 30.7738 12.5309 7.4954 6.7420 14.6204 46.6981
temp: 298.150 k
press: 1.00000 atm
elementType: 8 8 8 8 7 6 6 6 6 6 6 6 6 6 6 1 1 1 1 1 1 1 1 1 1 1 1 1
symmnumber: 1
zpe: 575949.5 jmol-1
zpe.correction: 0.219368 hartree
zpe.thermalcorrener: 0.235093 hartree
zpe.thermalcorrenthalpy: 0.236038 hartree
zpe.thermalcorrgfe: 0.173787 hartree
zpe.sumelectzpe: -743.353616 hartree
zpe.sumelectthermal: -743.337890 hartree
zpe.sumelectthermalent: -743.336946 hartree
zpe.sumelectthermalfe: -743.399197 hartree
dipole: -3.4484 0.4795 1.8333
dipole: 3.9348
quadrupole: -64.3090 -84.8588 -90.7970
quadrupole: 1.8082 7.1153 -2.0341
quadrupole: 15.6792 -4.8705 -10.8087 1.8082 7.1153 -2.0341
hfenergy: -743.5729836 hartree
pointgroup: C01 [X(C10H13N1O4)]
dipole: -1.3896812 0.1690269 0.6608231 debye
polarizability: 184.8304756|4.0189329|148.2588268|2.4318061|0.8883095|69.7367262 unknown
InChI: InChI=1S/C10H13NO4/c1-11-10(12)15-9-5-3-4-8(6-9)14-7-13-2/h3-6,11H,7H2,1-2H3
charge 0 multiplicity 1
28 atoms
O  2.662134 0.05644 -0.254049
O  -2.300773 0.5008 -0.045496
O  3.925172 -1.926848 -0.188857
O  -1.890106 -1.857727 -0.060404
N  -4.043347 -0.920592 -0.036959
C  1.458709 0.770418 -0.162252
C  -0.957512 0.97689 -0.059226
C  0.184376 0.146937 -0.149404
C  1.587177 2.179536 -0.092777
C  -0.858125 2.382126 0.013482
C  0.425653 2.971463 -0.006904
C  2.598761 -1.428599 -0.224602
C  -2.67009 -0.873204 -0.049118
C  -4.778415 -2.187564 -0.038589
C  4.639245 -1.624009 1.063588
H  0.055321 -0.933462 -0.211049
H  2.586838 2.622462 -0.110496
H  -1.768463 2.983501 0.080116
H  0.518166 4.061401 0.04596
H  2.006294 -1.732734 0.668563
H  2.147654 -1.805879 -1.158973
H  -4.541301 -0.030225 -0.027996
H  -4.043413 -3.007665 -0.046914
H  -5.419164 -2.277385 -0.934985
H  -5.408329 -2.285665 0.864559
H  4.06747 -1.990272 1.941514
H  4.813212 -0.538141 1.160508
H  5.598154 -2.158503 0.994161
