program: Gaussian 09
title: 000028852
version: EM64L-G09RevD.01
frameworkgroup: C1[X(C10H8N2O6)]
method: RPBEPBE
basis: SDD
operation: Freq
keyword: #p
keyword: freq=noraman
keyword: PBEPBE/SDD
title: #p freq=noraman PBEPBE/SDD
converged: YES YES NO NO
title: Mulliken charges:
elementType: O O O O O O N N C C C C C C C C C C H H H H H H H H
charge: -0.199061 -0.201166 -0.285126 -0.222107 -0.210087 -0.188037 -0.030472 0.051017 0.031288 -0.053219 0.325903 0.300447 -0.315636 -0.753348 0.279094 -0.309726 0.190795 -0.498771 0.285872 0.257865 0.251100 0.263943 0.295030 0.244494 0.255962 0.233946
chargesum: 0.00000
title: Mulliken charges with hydrogens summed into heavy atoms:
elementType: O O O O O O N N C C C C C C C C C C
charge: -0.199061 -0.201166 -0.285126 -0.222107 -0.210087 -0.188037 -0.030472 0.051017 0.031288 -0.053219 0.325903 0.300447 -0.029764 0.019560 0.279094 -0.014696 0.190795 0.235631
polarizability: 2.25289664e+02 -1.27550853e+01 1.57821051e+02 -1.31764771e+01 -1.33434363e+01 8.38421745e+01
1716.lowfreq: -3.7896 -0.0006 -0.0002 0.0002 1.8517 6.2437 22.3546 33.5523 46.1986
frequency: 22.3277 33.5429 46.1812 50.9661 72.5880 85.2283 93.1996 124.0948 130.1281 160.8867 187.0484 224.9028 252.7967 276.4514 279.3158 303.9303 346.1995 386.2201 417.8362 461.7522 516.0672 548.2811 568.1848 603.9644 638.1899 674.4608 686.6310 703.3022 737.3860 742.9320 765.1236 822.2368 830.0514 878.3673 902.6930 906.0685 923.2510 936.2897 989.5906 1022.8673 1039.3680 1063.8725 1115.1910 1120.2932 1142.6998 1149.9781 1187.6129 1198.6440 1253.4267 1277.0467 1344.7869 1363.4970 1387.1040 1400.6420 1406.9448 1430.2210 1445.7495 1451.5113 1461.4070 1464.1128 1515.6105 1568.7716 1601.2281 1649.4083 3004.5772 3008.6538 3090.5112 3112.7226 3124.1432 3153.8772 3240.4215 3261.5405
redmass: 3.7198 3.6110 1.4872 6.9764 3.7110 4.8398 1.2821 5.4990 3.8513 5.6189 7.3893 7.3606 4.2379 5.3486 8.0048 4.9580 4.7864 7.6412 9.0027 9.0329 7.3536 7.7215 5.1329 6.4434 6.6310 6.9575 8.1449 6.5512 11.9315 6.3441 7.8522 1.8846 3.3111 8.3661 5.5664 1.5294 7.3980 2.7661 4.9533 1.2798 1.5220 4.5790 1.2725 5.1059 5.2061 1.5462 4.1796 2.0770 7.2488 7.9963 5.1247 8.1608 8.0909 2.0823 1.5966 1.4536 1.0555 1.0491 1.0849 1.0527 7.8912 9.4283 8.9629 10.9755 1.0376 1.0294 1.0954 1.1048 1.1012 1.1052 1.0961 1.1041
irintensity: 4.0553 1.4043 0.8980 0.2511 0.2540 4.4525 0.6063 0.9655 2.4546 4.5233 1.6470 3.8444 5.3340 10.2475 0.8051 0.0499 12.4923 6.2063 0.2921 3.6573 1.3537 2.9270 0.7824 1.9955 2.7251 1.8663 8.1198 5.1288 23.9113 5.1953 11.5276 43.7094 52.1948 16.1827 2.7614 1.0619 9.3102 18.9066 10.1809 41.0468 11.6267 218.8306 1.1053 27.7372 92.7176 28.3073 7.0631 10.6826 325.2295 21.4954 97.8128 50.9276 24.7719 76.7932 110.3586 82.4407 19.1536 14.8803 15.6642 13.7104 56.3415 19.4942 3.0495 242.0645 2.7304 28.6142 4.1825 19.6153 5.8726 13.7387 0.2564 6.1693
temp: 298.150 k
press: 1.00000 atm
elementType: 8 8 8 8 8 8 7 7 6 6 6 6 6 6 6 6 6 6 1 1 1 1 1 1 1 1
symmnumber: 1
zpe: 456896.4 jmol-1
zpe.correction: 0.174023 hartree
zpe.thermalcorrener: 0.191007 hartree
zpe.thermalcorrenthalpy: 0.191951 hartree
zpe.thermalcorrgfe: 0.126347 hartree
zpe.sumelectzpe: -945.247702 hartree
zpe.sumelectthermal: -945.230718 hartree
zpe.sumelectthermalent: -945.229774 hartree
zpe.sumelectthermalfe: -945.295378 hartree
dipole: 6.0679 -0.6366 1.6189
dipole: 6.3123
quadrupole: -100.3803 -101.1250 -102.8067
quadrupole: 21.9319 -5.4012 -2.5372
quadrupole: 1.0570 0.3124 -1.3694 21.9319 -5.4012 -2.5372
hfenergy: -945.4217248 hartree
pointgroup: C01 [X(C10H8N2O6)]
dipole: -2.3516956 -0.1009488 -0.7917477 debye
dipolederiv: -0.2226543 0.1601435 0.108397 0.190681 -0.3306129 -0.1934791 0.0289035 -0.2026302 -0.1951592 -0.8354488 -0.0473979 -0.0048671 0.1387579 -0.5254342 0.093742 -0.0583082 0.0658845 -0.1466487 -0.7452524 0.5295521 0.1310452 0.4527533 -1.2106177 -0.0109447 0.1669375 -0.1477614 -0.3410214 -0.7443225 0.0539225 0.2485768 -0.0569642 -0.6191819 0.155394 0.2377225 0.0333321 -0.4306131 -1.0839013 -0.0748707 0.0056173 -0.0211886 -0.3738621 -0.1013156 0.0429759 -0.0912967 -0.3046463 -0.4357515 0.0360871 0.0470264 -0.135739 -0.6311542 -0.2981157 -0.076257 -0.2930117 -0.4133696 0.2351513 -0.019895 0.0158512 0.107993 -0.2271729 0.0171354 0.0313101 0.000801 -0.1407966 1.7220918 0.3245245 0.1104569 0.6190863 1.0972248 0.5976202 0.3143596 0.5668009 0.5906793 0.5909025 -0.2025858 0.0086711 -0.3800074 0.2522712 -0.0792688 0.0497509 0.0204141 0.0587426 -0.59946 -0.1028069 0.0995803 -0.019751 -0.5966251 0.0980728 0.1094499 0.0916593 -0.0995128 0.3664221 -0.0701071 -0.0155582 -0.1972334 0.1343169 0.0962001 -0.1899938 0.0457649 0.1275682 0.7490942 0.1916908 -0.1144477 -0.0826976 0.4759284 -0.058802 -0.0942647 -0.1063045 0.141073 -0.4526203 -0.0775689 -0.0531694 0.1083405 0.0250728 0.1065361 0.1123817 0.1098991 -0.0873421 -0.215424 0.0773778 0.0271163 0.2253782 -0.0092572 -0.0053644 0.0993484 0.0020517 0.0150091 -0.3075862 -0.2991911 -0.1998331 -0.7600684 -0.2467253 -0.1991682 -0.4348278 -0.1937704 -0.0168708 0.1852921 0.0729162 0.0263614 0.2943136 0.0903667 0.1227652 0.1384982 0.1316298 -0.0388158 1.2115771 -0.4295372 -0.446307 -0.2969119 1.6286395 -0.2040671 -0.4329915 0.0494478 0.5085069 0.2198734 -0.0429971 0.0109317 -0.1647054 0.6795664 -0.0218045 0.0298034 -0.0356783 0.2563338 0.1171817 -0.0517511 -0.0227884 -0.0434243 0.0941082 -0.0619677 -0.0222615 -0.052101 0.1480603 0.0617706 0.0165205 0.0141728 0.0244369 0.0552163 0.0896109 -0.0275379 0.0855816 0.0283857 0.0305925 -0.0524932 -0.0041536 -0.1237459 -0.012898 -0.0146419 -0.0283467 -0.014297 0.133225 0.0336858 0.0088831 -0.0066566 0.0229601 0.0986284 -0.071665 0.0196142 -0.0661383 -0.0080574 0.0627978 0.0130712 0.0179835 -0.0060075 0.1583819 -0.0263654 0.0070168 -0.0278173 0.1812271 0.1061207 -0.0298138 0.0203801 0.0317702 -0.0165467 -0.0114627 -0.0178655 0.0731293 -0.1059532 -0.0095654 -0.0956135 -0.0887671 0.0143389 -0.010305 -0.0060572 -0.0767785 -0.0079155 0.0505905 -0.040567 0.1119398 0.06438 0.0576346 0.0206717 -0.0125867 0.0713603 -0.0376739 0.0894054 unknown
polarizability: 227.4612675|8.2609021|155.7948295|-3.0308673|16.5903214|83.6967919 unknown
InChI: InChI=1S/C10H8N2O6/c1-5-8(10(13)16-2)9(11-18-5)6-3-4-7(17-6)12(14)15/h3-4H,1-2H3
charge 0 multiplicity 1
26 atoms
O  1.337321 -0.114852 0.570419
O  -2.804321 -2.105044 0.368856
O  -2.516023 2.111917 0.092865
O  -0.438974 1.702083 -0.894569
O  4.883668 0.377485 0.585978
O  3.19719 1.605894 1.553638
N  -1.376992 -2.422845 0.272774
N  3.635318 0.612471 0.856596
C  -0.78607 -1.215397 0.06211
C  -1.743844 -0.128634 0.029784
C  0.66432 -1.17813 -0.059134
C  -2.986686 -0.726773 0.240087
C  1.586921 -2.038931 -0.656008
C  -4.391354 -0.236708 0.336607
C  2.692355 -0.335395 0.326465
C  2.891724 -1.494585 -0.416087
C  -1.460664 1.280774 -0.306567
C  -2.327553 3.553342 -0.213213
H  1.339373 -2.941867 -1.208862
H  -4.592695 0.515477 -0.442952
H  -5.096207 -1.07778 0.238771
H  -4.560173 0.260104 1.308716
H  3.853026 -1.884581 -0.738967
H  -2.23138 3.703549 -1.30153
H  -1.419201 3.92814 0.286372
H  -3.229278 4.042784 0.179651
