program: Gaussian 09
title: 000028845
version: EM64L-G09RevD.01
frameworkgroup: C1[X(C12H23N)]
method: RPBEPBE
basis: SDD
operation: Freq
keyword: #pfreq=noraman
keyword: PBEPBE/SDD
title: #p freq=noraman PBEPBE/SDD
converged: YES YES NO NO
title: Mulliken charges:
elementType: N C C C C C C C C C C C C H H H H H H H H H H H H H H H H H H H H H H H
charge: -0.077220 -0.246438 -0.071504 -0.499154 0.338030 -0.589896 -0.438259 -0.759398 0.149330 -0.804116 -0.802211 -0.614131 -0.625537 0.213123 0.251173 0.213982 0.212082 0.219500 0.224704 0.226341 0.205779 0.211891 0.211444 0.225045 0.214948 0.220444 0.237133 0.217128 0.219274 0.246977 0.219556 0.224846 0.186679 0.232700 0.219055 0.186700
chargesum: 0.00000
title: Mulliken charges with hydrogens summed into heavy atoms:
elementType: N C C C C C C C C C C C C
charge: -0.077220 -0.033315 0.179669 -0.073090 0.338030 -0.145692 -0.006139 -0.111018 0.149330 -0.131590 -0.118832 0.016951 0.012917
polarizability: 1.52897480e+02 9.37846199e+00 1.41196501e+02 8.76060104e-01 -4.90258876e+00 1.15443853e+02
1716.lowfreq: -11.3164 -0.0007 -0.0006 -0.0001 6.7023 9.9087 31.2957 47.6439 81.7378
frequency: 29.7474 47.1709 81.6819 87.3629 96.0437 126.1134 147.6070 184.9296 192.8779 194.2683 217.4819 229.9085 238.5191 278.4526 302.0742 328.8347 355.3503 364.3596 382.6433 437.9281 474.4516 520.6157 532.0549 565.3653 660.6127 770.5619 779.8369 825.0174 840.8256 892.2623 911.5321 941.7276 949.3048 967.4801 977.7352 984.6340 1024.7285 1034.1361 1035.7202 1063.3059 1078.0776 1079.8112 1090.4610 1095.0477 1114.1336 1138.3744 1156.6822 1164.7971 1182.2097 1188.3062 1236.1767 1253.2921 1263.1482 1272.0235 1273.3973 1294.0292 1306.0018 1320.3435 1353.8696 1357.1410 1383.6113 1386.0626 1396.8230 1417.6088 1439.6947 1456.3358 1458.5830 1460.7260 1463.1519 1466.1750 1470.8455 1474.2402 1474.9253 1475.9242 1476.8828 1479.4171 1484.9235 1487.8821 1698.8873 2839.1833 2843.6956 2861.1265 2952.8269 2957.2390 2966.2451 2969.1892 2987.1256 2991.7683 3014.4177 3018.1707 3018.4977 3020.0538 3021.1014 3022.7835 3025.6781 3054.1127 3062.3474 3064.3444 3073.7536 3082.2218 3087.0942 3092.4123
redmass: 2.7284 2.7477 2.7312 2.6330 1.0253 2.4366 1.1368 2.3441 1.9446 1.9011 1.1156 1.1524 1.5557 2.5674 2.4566 2.6154 2.4365 1.9887 2.0799 2.2474 2.8777 3.1643 3.3294 2.6559 2.5955 3.5452 2.2842 2.1336 3.1004 2.0149 2.4080 1.5466 1.3735 1.3022 1.7051 1.9941 2.2508 1.5457 1.7265 2.4823 1.5148 1.5962 1.3321 1.6598 1.4302 1.4257 1.8665 2.7076 1.7339 1.9958 1.5989 2.7739 2.3270 1.7339 1.3244 1.4736 1.4532 1.4475 1.4585 1.3291 1.2164 1.2533 1.2086 1.1401 1.1533 1.0776 1.0578 1.0544 1.0690 1.0509 1.0633 1.0601 1.0630 1.0493 1.0630 1.0536 1.0626 1.0735 7.7925 1.0580 1.0656 1.0618 1.0389 1.0387 1.0398 1.0573 1.0807 1.0677 1.0719 1.0948 1.0916 1.0880 1.0953 1.0922 1.0720 1.1030 1.0991 1.0988 1.1009 1.1001 1.0956 1.0956
irintensity: 0.2184 0.1601 0.5763 0.4967 0.2117 0.1228 1.0439 0.9120 0.2597 0.3685 0.1517 0.3293 0.2086 2.3465 3.2187 6.0537 0.6614 5.4420 0.4661 1.1574 2.1900 1.0837 1.9961 4.7159 2.3517 5.3449 2.4395 7.7570 4.2645 2.7568 2.5968 0.6019 0.9301 1.8037 1.8602 4.1011 40.0141 18.2457 2.1174 30.7446 1.0894 2.0478 8.4152 14.0342 13.8985 4.8567 1.7584 5.0779 8.4741 8.8895 5.4058 4.8637 4.7994 6.4819 0.3381 2.2779 0.6004 2.4871 3.2229 3.8929 17.5573 19.8747 8.6962 3.3741 1.3951 3.2912 13.9700 9.1621 8.4837 10.5552 10.7632 9.6515 17.2451 16.0462 4.1761 14.1415 11.2520 10.9420 1.3192 71.1097 59.3567 226.1670 25.9772 88.4533 27.9260 37.7307 25.1214 15.9503 40.8129 12.6676 10.7724 38.4372 60.2464 28.4425 39.4213 39.7848 56.1254 59.9621 33.0563 51.6393 33.9892 26.6020
temp: 298.150 k
press: 1.00000 atm
elementType: 7 6 6 6 6 6 6 6 6 6 6 6 6 1 1 1 1 1 1 1 1 1 1 1 1 1 1 1 1 1 1 1 1 1 1 1
symmnumber: 1
zpe: 850369.5 jmol-1
zpe.correction: 0.323889 hartree
zpe.thermalcorrener: 0.340049 hartree
zpe.thermalcorrenthalpy: 0.340993 hartree
zpe.thermalcorrgfe: 0.280521 hartree
zpe.sumelectzpe: -524.729460 hartree
zpe.sumelectthermal: -524.713300 hartree
zpe.sumelectthermalent: -524.712356 hartree
zpe.sumelectthermalfe: -524.772828 hartree
dipole: 0.1337 -0.9185 -0.1692
dipole: 0.9434
quadrupole: -80.3696 -82.9693 -82.0991
quadrupole: -1.6781 0.2537 -0.9391
quadrupole: 1.4431 -1.1566 -0.2864 -1.6781 0.2537 -0.9391
hfenergy: -525.053349 hartree
pointgroup: C01 [X(C12H23N1)]
dipole: 0.0583969 0.3631004 0.0502157 debye
polarizability: 152.5531367|-9.5150827|141.0186988|0.1360886|-6.2823154|115.9659991 unknown
InChI: InChI=1S/C12H23N/c1-9(2)11-7-6-10(3)12(11)8-13(4)5/h10,12H,6-8H2,1-5H3
charge 0 multiplicity 1
36 atoms
N  2.586263 0.351744 0.188929
C  0.158686 -0.181308 -0.373944
C  0.345957 -1.721879 -0.219217
C  -0.525036 -2.055668 1.027292
C  -1.285943 0.078774 0.084381
C  -1.769553 -1.132799 0.897909
C  1.16332 0.617203 0.509483
C  -0.127299 -2.485357 -1.476826
C  -2.030181 1.188607 -0.197131
C  -1.524759 2.34861 -1.042546
C  -3.456567 1.362654 0.302228
C  3.493165 0.813551 1.25913
C  2.992713 0.866796 -1.133068
H  0.297874 0.120354 -1.430675
H  1.414205 -1.944294 -0.038926
H  0.032871 -1.815246 1.95252
H  -0.795367 -3.126232 1.077997
H  -2.178987 -0.8478 1.885606
H  -2.585302 -1.657365 0.360491
H  1.001763 0.336388 1.568019
H  0.920609 1.708334 0.428823
H  0.483147 -2.214013 -2.359083
H  -0.044554 -3.579183 -1.333538
H  -1.182542 -2.253503 -1.717045
H  -2.236444 2.56898 -1.863665
H  -1.445016 3.276311 -0.439943
H  -0.536977 2.153743 -1.491499
H  -3.55336 2.284787 0.910919
H  -4.159846 1.474397 -0.548116
H  -3.798619 0.513361 0.915428
H  4.53137 0.517382 1.021936
H  3.212332 0.338064 2.215993
H  3.478842 1.923993 1.40886
H  2.39237 0.396812 -1.930624
H  4.052292 0.613971 -1.317822
H  2.880874 1.97863 -1.224276
