program: Gaussian 09
title: 000028855
version: EM64L-G09RevD.01
frameworkgroup: C1[X(C15H10N2O5)]
method: RPBEPBE
basis: SDD
operation: Freq
keyword: #p
keyword: freq=noraman
keyword: PBEPBE/SDD
title: #p freq=noraman PBEPBE/SDD
converged: YES YES NO NO
title: Mulliken charges:
elementType: O O O O O N N C C C C C C C C C C C C C C C H H H H H H H H H H
charge: -0.208779 -0.224340 -0.183837 -0.207262 -0.194034 -0.028446 0.051096 0.027670 0.169180 0.002424 0.287867 0.319235 0.106146 -0.321032 -0.351039 -0.365753 -0.309670 0.281197 -0.753570 -0.230186 -0.238433 -0.231056 0.288942 0.265023 0.255276 0.295821 0.250910 0.269053 0.259530 0.238425 0.240328 0.239318
chargesum: 0.00000
title: Mulliken charges with hydrogens summed into heavy atoms:
elementType: O O O O O N N C C C C C C C C C C C C C C C
charge: -0.208779 -0.224340 -0.183837 -0.207262 -0.194034 -0.028446 0.051096 0.027670 0.169180 0.002424 0.287867 0.319235 0.106146 -0.032090 -0.086017 -0.110477 -0.013849 0.281197 0.025922 0.008239 0.001895 0.008262
polarizability: 3.55123262e+02 1.71452451e+00 1.93174967e+02 -1.25680120e+01 -2.74203958e+00 1.05273383e+02
1716.lowfreq: -6.2275 -0.0006 -0.0005 -0.0003 0.5773 3.9100 16.0304 28.5919 41.8831
frequency: 15.4585 28.5748 41.8809 43.8432 60.5889 74.0201 91.8541 113.4111 131.1924 143.5297 154.8284 187.0042 208.3789 225.3282 268.2626 298.3641 348.4505 363.5937 401.6287 405.8240 433.1382 462.4405 491.7708 523.5629 542.7343 566.1033 600.6702 608.1847 618.0817 629.7965 663.8748 685.1513 696.4552 698.1668 736.6204 742.7810 779.8455 827.3894 855.1523 856.6083 883.3146 908.3994 921.7599 932.8640 939.0362 953.1882 984.0984 988.5724 1002.5637 1005.8039 1012.5260 1024.7455 1025.7463 1039.9546 1092.3260 1126.8444 1142.3710 1178.7090 1190.5037 1197.5603 1209.9389 1258.3003 1276.9753 1325.9229 1343.2419 1358.3538 1372.3865 1379.4594 1386.5715 1393.2673 1437.1101 1439.0403 1448.5885 1478.5499 1514.8765 1567.9835 1585.7572 1600.8075 1607.8867 1616.8030 2983.0004 3073.1038 3123.5030 3135.5439 3143.4919 3154.1301 3163.9803 3174.9037 3240.7349 3261.0594
redmass: 4.6425 7.4821 7.2597 4.6136 6.8406 9.2975 4.1099 3.1336 2.2292 2.8596 4.3521 6.3983 6.3591 7.8633 6.0078 6.1144 5.4294 8.5557 2.8262 6.3511 7.7193 8.2543 3.8947 6.1264 6.1894 5.4914 4.0738 6.2586 6.1475 5.6882 5.6369 8.4353 5.8340 1.8665 12.4192 4.1978 2.1577 1.3389 1.2487 11.3161 9.6742 1.4003 8.2981 1.8637 3.3157 3.1972 1.5346 4.3331 2.3159 1.5703 2.1367 1.6911 1.9052 2.3646 1.7314 3.6631 6.5942 1.0566 2.9121 1.1493 2.5159 8.6197 6.1315 1.4019 4.7478 7.5079 1.3089 6.0477 7.4936 6.0594 1.6014 1.3654 1.0694 2.3999 7.9680 7.8720 6.5685 8.5908 8.5775 6.4700 1.0388 1.0928 1.1020 1.0855 1.0884 1.0930 1.0967 1.1015 1.0961 1.1041
irintensity: 7.2673 1.6457 1.6104 1.4933 1.6627 2.4663 0.8873 1.1512 2.4327 1.8340 1.2371 1.7347 0.9895 1.0967 2.7529 0.4612 2.0567 0.7312 0.1158 2.3098 1.2986 3.3130 7.2657 0.6786 1.0896 0.7205 13.6064 0.6231 1.0194 8.9202 3.6779 8.3646 4.4453 44.4221 13.4238 42.0057 34.4067 63.6896 1.1208 31.1673 14.5730 0.8425 9.5506 7.7672 6.9703 13.5931 1.7542 0.6554 4.9591 1.5376 2.6305 13.5213 39.6093 2.8248 5.0319 17.7375 67.4414 0.0835 18.7844 6.2327 72.7647 357.6060 18.3025 4.1392 80.1144 47.9274 52.1361 19.7651 41.2991 147.0632 26.1069 15.7504 18.0513 26.8331 76.3650 54.0256 6.4111 42.8225 86.4927 10.2132 0.4552 6.7622 7.5655 1.0658 2.6977 17.3560 14.2716 17.5784 0.6171 7.6036
temp: 298.150 k
press: 1.00000 atm
elementType: 8 8 8 8 8 7 7 6 6 6 6 6 6 6 6 6 6 6 6 6 6 6 1 1 1 1 1 1 1 1 1 1
symmnumber: 1
zpe: 581568.8 jmol-1
zpe.correction: 0.221508 hartree
zpe.thermalcorrener: 0.240466 hartree
zpe.thermalcorrenthalpy: 0.241410 hartree
zpe.thermalcorrgfe: 0.170978 hartree
zpe.sumelectzpe: -1061.521455 hartree
zpe.sumelectthermal: -1061.502496 hartree
zpe.sumelectthermalent: -1061.501552 hartree
zpe.sumelectthermalfe: -1061.571985 hartree
dipole: 6.0548 1.6989 -0.7083
dipole: 6.3284
quadrupole: -120.7518 -127.4224 -128.7136
quadrupole: -24.6610 -6.6712 1.2937
quadrupole: 4.8775 -1.7931 -3.0844 -24.6610 -6.6712 1.2937
hfenergy: -1061.7429625 hartree
pointgroup: C01 [X(C15H10N2O5)]
dipole: -2.3380554 0.575329 0.6336607 debye
polarizability: 353.5152211|-0.2267868|177.5790365|-22.5931368|34.0542231|122.4773543 unknown
InChI: InChI=1S/C15H10N2O5/c1-9(18)13-14(11-7-8-12(21-11)17(19)20)16-22-15(13)10-5-3-2-4-6-10/h2-8H,1H3
charge 0 multiplicity 1
32 atoms
O  -1.555059 1.868652 1.014634
O  2.417875 -0.22604 0.014441
O  0.245426 -0.952611 -2.070721
O  5.897543 -0.952558 -0.404704
O  4.07672 -2.350411 -0.245234
N  -0.131511 2.15269 1.016449
N  4.627467 -1.18204 -0.264943
C  -0.568925 0.143608 -0.102853
C  -1.789551 0.64635 0.347524
C  0.415107 1.113908 0.323444
C  -3.187582 0.227082 0.236156
C  1.856111 1.058106 0.155105
C  -0.292551 -1.08057 -0.93894
C  2.864759 2.022875 0.123796
C  -4.143807 0.692659 1.182167
C  -3.610098 -0.628229 -0.819696
C  4.108465 1.331129 -0.052541
C  3.793289 -0.022444 -0.113176
C  -0.616837 -2.432523 -0.331397
C  -5.491095 0.293406 1.081307
C  -4.959156 -1.026377 -0.911166
C  -5.903113 -0.57081 0.038941
H  2.712046 3.096202 0.206665
H  -3.821792 1.359318 1.988208
H  -2.898367 -0.950644 -1.586999
H  5.106452 1.753974 -0.129329
H  -1.55815 -2.419863 0.24421
H  0.198117 -2.689529 0.374507
H  -0.649878 -3.206883 -1.113793
H  -6.219674 0.653841 1.814993
H  -5.275881 -1.679815 -1.730711
H  -6.951151 -0.879651 -0.037244
