program: Gaussian 09
title: 000028831
version: EM64L-G09RevD.01
frameworkgroup: C1[X(C16H22N2)]
method: RPBEPBE
basis: SDD
operation: Freq
keyword: #pfreq=noraman
keyword: PBEPBE/SDD
title: #p freq=noraman PBEPBE/SDD
converged: YES YES NO NO
title: Mulliken charges:
elementType: N N C C C C C C C C C C C C C C C C H H H H H H H H H H H H H H H H H H H H H H
charge: -0.243387 -0.569923 0.235944 0.177176 -0.538245 -0.547414 -0.377680 -0.381820 -0.376842 0.137105 0.225866 -0.441272 -0.349129 -0.424469 -0.367470 -0.259657 -0.241589 -0.376253 0.211924 0.220602 0.204827 0.208664 0.208545 0.197589 0.195245 0.205981 0.184320 0.199824 0.215356 0.218256 0.229472 0.213873 0.226022 0.224971 0.216065 0.215610 0.204779 0.177053 0.276079 0.264002
chargesum: 0.00000
title: Mulliken charges with hydrogens summed into heavy atoms:
elementType: N N C C C C C C C C C C C C C C C C
charge: -0.243387 -0.029842 0.235944 0.177176 -0.105719 -0.133922 0.028455 0.019405 0.007302 0.137105 0.225866 -0.007660 0.094216 -0.198448 -0.142498 -0.043593 -0.025979 0.005579
polarizability: 2.04097497e+02 2.28949787e+00 2.33448300e+02 1.15635456e+01 1.33772333e+01 1.20256764e+02
1716.lowfreq: -0.0006 -0.0003 0.0002 7.0840 10.9237 12.9980 31.9781 43.6430 58.7421
frequency: 31.7374 43.3679 58.6750 69.6774 108.0486 120.6915 154.9466 166.1696 180.7414 227.4275 240.6420 253.2807 263.8114 299.0775 329.9474 350.6346 367.1505 393.9279 434.0514 453.8053 464.4107 512.1932 542.2517 579.0743 584.6217 596.3958 604.9410 667.0929 691.7179 743.9231 756.7930 757.2994 766.3789 779.2486 815.5995 823.0836 842.5558 877.0632 894.2663 913.0163 922.4286 948.3839 963.2709 965.3171 968.0207 1003.7049 1015.3416 1035.7242 1058.1186 1072.4075 1087.7422 1111.2047 1115.2881 1122.8740 1138.7165 1152.9602 1161.9712 1187.8495 1207.3636 1219.0140 1229.0968 1241.9484 1267.3072 1271.9625 1280.8659 1284.9052 1298.3649 1318.1309 1320.4812 1340.7960 1342.7640 1352.9156 1356.2985 1363.7269 1377.4780 1392.1953 1412.1518 1422.0751 1458.0900 1459.1667 1462.6403 1464.2229 1468.5963 1471.1630 1475.4156 1477.6528 1489.9800 1499.4243 1573.6827 1581.1925 1621.4152 1640.5343 2854.3926 2942.9827 2952.0317 2953.0747 2967.7499 2969.9704 2985.7459 2998.8493 3005.7403 3012.8533 3022.4816 3027.3078 3033.9412 3037.8189 3040.9210 3067.5150 3117.8074 3125.2478 3139.5389 3158.3595 3457.8960 3585.6073
redmass: 4.3276 4.0857 3.2974 1.6815 3.0161 2.6189 2.9405 3.5258 3.2213 2.3080 1.4176 2.4711 3.6787 2.4323 2.2704 2.4541 2.8577 3.4866 2.8157 3.3303 2.1959 3.3455 3.6215 3.6570 2.9729 1.3711 4.5783 4.4106 3.6899 1.3911 1.6537 3.3643 1.8004 2.4581 1.5244 1.7311 1.4892 1.6336 2.0136 2.5342 1.4204 2.2869 1.3034 1.8538 2.2993 3.2080 2.0518 2.9197 2.5088 1.9886 2.2448 2.2199 2.1476 1.6354 1.3494 1.4673 1.3107 1.7685 1.5432 1.3482 1.4081 1.4406 1.2603 1.2218 1.2822 1.0866 1.3189 1.3766 1.5303 1.5422 1.5880 1.7197 1.6399 1.3334 1.9727 1.4630 4.9028 3.0536 1.1318 1.1260 1.2274 1.1769 1.5759 1.5005 1.1310 2.8480 1.0942 1.0954 7.3787 7.0882 7.4015 1.0939 1.0719 1.0673 1.0675 1.0614 1.0623 1.0620 1.0645 1.0674 1.0759 1.0968 1.0922 1.1018 1.0980 1.0972 1.0982 1.1039 1.0843 1.0884 1.0947 1.1000 1.0449 1.0978
irintensity: 0.5312 0.1130 0.4383 4.6123 0.5999 0.3829 0.8436 0.5344 2.0845 3.6514 43.9029 13.7826 3.7693 1.6910 0.2116 0.3986 2.2255 5.7831 13.2600 13.8254 1.8079 1.9283 2.5596 0.4691 19.4038 188.9483 9.0469 0.8822 7.5750 92.4227 5.4779 1.9665 2.9006 0.5332 9.6035 0.3891 0.3304 0.7609 1.7981 0.7940 1.5177 4.6155 0.0461 2.0226 6.9536 0.5083 13.3921 0.8394 1.3740 1.0529 3.5441 5.6994 14.5879 1.9817 7.5552 10.1838 7.8193 8.6209 4.8048 11.8982 1.9770 10.5497 4.0308 11.1347 3.2587 2.1916 2.6774 13.8485 4.3051 1.9761 16.8812 20.5690 6.5715 12.0515 21.4282 22.4823 36.1727 21.6844 1.2456 5.5769 11.0755 8.2406 21.1357 22.5968 4.0492 29.1644 3.9336 20.7168 4.3434 1.2521 5.3410 41.8633 111.8225 43.2616 31.5330 26.7187 45.4477 41.8156 1.7074 16.1022 75.8362 85.6380 57.6978 11.0448 72.3597 60.5632 11.1856 50.4568 3.1437 4.9465 45.6018 37.0112 1.0153 0.3281
temp: 298.150 k
press: 1.00000 atm
elementType: 7 7 6 6 6 6 6 6 6 6 6 6 6 6 6 6 6 6 1 1 1 1 1 1 1 1 1 1 1 1 1 1 1 1 1 1 1 1 1 1
symmnumber: 1
zpe: 913300.5 jmol-1
zpe.correction: 0.347858 hartree
zpe.thermalcorrener: 0.364848 hartree
zpe.thermalcorrenthalpy: 0.365792 hartree
zpe.thermalcorrgfe: 0.302784 hartree
zpe.sumelectzpe: -731.060307 hartree
zpe.sumelectthermal: -731.043317 hartree
zpe.sumelectthermalent: -731.042372 hartree
zpe.sumelectthermalfe: -731.105380 hartree
dipole: -2.5696 -1.4384 -0.6093
dipole: 3.0071
quadrupole: -91.2927 -109.5393 -111.2413
quadrupole: -5.5900 2.6459 4.6598
quadrupole: 12.7317 -5.5149 -7.2169 -5.5900 2.6459 4.6598
hfenergy: -731.4081647 hartree
pointgroup: C01 [X(C16H22N2)]
dipole: 1.0451235 0.5011376 -0.2372771 debye
polarizability: 204.432968|4.3116804|233.3201515|-12.6756784|-11.1775474|120.0494415 unknown
InChI: InChI=1S/C16H22N2/c17-11-6-12-18-15-9-3-1-2-7-13(15)14-8-4-5-10-16(14)18/h4-5,8,10H,1-3,6-7,9,11-12,17H2
charge 0 multiplicity 1
40 atoms
N  0.619561 -0.19337 -0.673801
N  5.161951 0.844157 1.1328
C  -0.367362 0.822419 -0.594158
C  -1.58756 0.251538 -0.211917
C  -0.075074 2.270709 -0.899266
C  -2.897431 0.982944 -0.023771
C  -0.522176 3.25451 0.218637
C  -2.828928 2.208381 0.92686
C  -2.054876 3.427641 0.365757
C  -1.35668 -1.167876 -0.03248
C  0.032967 -1.417951 -0.320616
C  2.046243 -0.016093 -0.975826
C  2.891866 0.365605 0.262543
C  -2.186807 -2.257357 0.343427
C  0.597497 -2.710669 -0.236539
C  -1.62962 -3.548755 0.426117
C  -0.250691 -3.773537 0.138799
C  4.397664 0.441326 -0.062727
H  1.006403 2.413388 -1.078933
H  -0.585283 2.564048 -1.841648
H  -3.296964 1.325687 -1.003003
H  -3.645069 0.270031 0.374048
H  -0.091847 2.926473 1.185653
H  -0.082978 4.247104 -0.008336
H  -3.865638 2.533919 1.149274
H  -2.377462 1.895374 1.889409
H  -2.481969 3.700868 -0.622998
H  -2.239728 4.294383 1.032174
H  2.421614 -0.962391 -1.408549
H  2.161179 0.752354 -1.762751
H  2.566583 1.342873 0.664706
H  2.717686 -0.385142 1.059451
H  -3.24842 -2.099013 0.566374
H  1.656142 -2.89616 -0.450392
H  -2.26103 -4.396497 0.715709
H  0.15655 -4.788409 0.212225
H  4.562913 1.20689 -0.846623
H  4.718727 -0.538323 -0.500106
H  6.145627 1.068217 0.956585
H  5.049822 0.209502 1.929895
