program: Gaussian 09
title: 000028820
version: EM64L-G09RevD.01
frameworkgroup: C1[X(C10H17NSi)]
method: RPBEPBE
basis: SDD
operation: Freq
keyword: #p
keyword: freq=noraman
keyword: PBEPBE/SDD
title: #p freq=noraman PBEPBE/SDD
converged: YES YES NO NO
title: Mulliken charges:
elementType: Si N C C C C C C C C C C H H H H H H H H H H H H H H H H H
charge: 1.262909 -0.545418 -0.743978 -0.136559 -1.051359 -1.003863 -0.377511 -0.320596 -0.329285 -0.229474 -0.236392 -0.236192 0.216377 0.212684 0.239010 0.239653 0.240937 0.240684 0.230635 0.233707 0.211128 0.227642 0.236518 0.222423 0.225093 0.224579 0.258053 0.260695 0.227900
chargesum: 0.00000
title: Mulliken charges with hydrogens summed into heavy atoms:
elementType: Si N C C C C C C C C C C
charge: 1.262909 -0.026670 -0.314917 -0.136559 -0.331758 -0.298837 0.061259 -0.084078 -0.106862 -0.004381 -0.011814 -0.008292
polarizability: 1.59954513e+02 1.64749083e+01 1.18098085e+02 -3.44420225e+00 5.98703124e+00 1.31387744e+02
1716.lowfreq: -7.3324 0.0017 0.0017 0.0017 5.3307 9.4374 17.9856 32.3024 62.3516
frequency: 17.1630 30.5072 62.2021 92.4242 114.3008 117.5117 130.1354 173.3189 189.3075 200.1679 205.0965 249.6935 262.2681 304.8452 339.0846 387.4104 391.9901 476.8103 602.8116 615.3021 627.8044 678.4286 697.8116 699.8251 707.0175 721.0324 747.7765 801.6701 807.4729 857.8837 861.1553 898.9926 907.6682 920.5996 976.8761 987.6728 991.6264 996.7763 1022.9286 1048.4581 1074.9171 1076.1519 1101.6745 1172.9436 1196.0413 1197.8438 1261.0154 1289.9227 1299.9758 1311.0616 1340.7874 1342.0572 1363.8751 1418.2164 1426.0006 1445.1151 1446.4981 1455.5745 1458.5702 1468.6978 1471.3374 1576.9172 1597.0197 1640.8813 2955.4895 2979.1515 2980.2819 2987.7066 3009.8688 3049.8697 3080.9862 3082.1998 3083.3922 3086.0707 3100.3716 3114.1258 3126.7968 3138.9310 3157.6117 3438.2387 3564.3244
redmass: 3.6558 3.7910 1.7254 2.9348 2.6176 1.3109 2.1102 1.1008 2.2034 2.6407 3.3236 1.0834 3.4293 3.7938 4.2015 4.0240 2.7546 3.3339 1.8334 6.3512 2.7027 2.8669 2.6017 1.9892 1.6294 1.9583 1.7896 1.3738 1.4696 1.3045 1.3626 1.4925 1.4632 1.3794 1.4046 6.2464 5.1013 1.3134 2.8872 1.0797 2.9940 1.8741 2.7671 1.0557 1.2721 1.2126 1.3203 1.2150 1.2094 1.4074 1.1672 1.1932 4.7509 2.1082 1.0792 1.0553 1.0613 1.0514 1.0758 1.0938 1.8965 5.4812 5.8428 1.0861 1.0580 1.0340 1.0344 1.0605 1.0994 1.1049 1.0982 1.0978 1.0983 1.0984 1.0877 1.0856 1.0903 1.0955 1.1014 1.0444 1.0969
irintensity: 0.1659 0.8502 2.5593 0.6818 0.1536 0.1500 0.0842 0.0573 0.4614 0.6663 2.4476 56.5068 8.2869 6.2978 4.6088 8.3159 0.0719 16.7495 181.5785 1.3853 171.5455 0.1596 8.5378 6.0149 82.9975 11.6416 44.1285 15.9381 26.8766 17.0349 33.3184 81.4867 109.5584 0.9276 0.0601 0.5248 60.2784 0.0504 1.2117 13.7941 20.6081 2.7513 38.7635 0.1292 8.3939 6.9113 3.0313 36.6660 21.1007 20.4363 3.4736 3.4879 1.2824 13.2159 4.7623 4.5373 3.2573 8.1856 13.9083 7.0435 2.6756 0.0376 0.0605 32.7243 16.6676 18.4681 10.0479 42.8437 6.8221 48.0422 4.3068 33.2885 14.5216 26.1588 12.9004 3.5295 5.2210 49.5185 32.8340 1.6161 0.0300
temp: 298.150 k
press: 1.00000 atm
elementType: 14 7 6 6 6 6 6 6 6 6 6 6 1 1 1 1 1 1 1 1 1 1 1 1 1 1 1 1 1
symmnumber: 1
zpe: 641738.7 jmol-1
zpe.correction: 0.244425 hartree
zpe.thermalcorrener: 0.259639 hartree
zpe.thermalcorrenthalpy: 0.260583 hartree
zpe.thermalcorrgfe: 0.200661 hartree
zpe.sumelectzpe: -734.489191 hartree
zpe.sumelectthermal: -734.473978 hartree
zpe.sumelectthermalent: -734.473033 hartree
zpe.sumelectthermalfe: -734.532955 hartree
dipole: 0.2101 0.8794 -1.0969
dipole: 1.4215
quadrupole: -75.6559 -87.9553 -77.6976
quadrupole: 6.2223 -4.4448 6.4760
quadrupole: 4.7804 -7.5190 2.7387 6.2223 -4.4448 6.4760
hfenergy: -734.7336162 hartree
pointgroup: C01 [X(C10H17N1Si1)]
dipole: -0.0814017 -0.260693 -0.4880419 debye
polarizability: 158.0326929|17.8195381|123.2670033|6.1103414|-8.2081331|128.140646 unknown
InChI: InChI=1S/C10H17NSi/c1-12(2,9-8-11)10-6-4-3-5-7-10/h3-7H,8-9,11H2,1-2H3
charge 0 multiplicity 1
29 atoms
Si -0.995186 -1.178972 -0.281517
N  -3.567192 2.148405 0.661021
C  -2.37894 0.156316 -0.451904
C  0.702605 -0.295638 -0.126493
C  -1.299644 -2.258487 1.269901
C  -0.991986 -2.275185 -1.853045
C  -2.541417 1.089104 0.784203
C  1.505473 -0.404447 1.0427
C  1.197367 0.505757 -1.194428
C  2.751175 0.258579 1.144516
C  2.440821 1.171582 -1.100844
C  3.22247 1.049675 0.072049
H  -2.157273 0.774634 -1.347609
H  -3.341299 -0.358749 -0.658316
H  -1.308267 -1.654323 2.195719
H  -2.276443 -2.771295 1.194869
H  -0.519981 -3.035383 1.375148
H  -0.218298 -3.06163 -1.783847
H  -1.972238 -2.767701 -1.993216
H  -0.781859 -1.673953 -2.75694
H  -2.792426 0.482413 1.675732
H  -1.574735 1.580925 1.00436
H  1.160553 -1.013805 1.887354
H  0.609017 0.613586 -2.11588
H  3.350454 0.158441 2.057107
H  2.799211 1.78215 -1.937967
H  -4.519239 1.784417 0.541149
H  -3.346717 2.848416 -0.056157
H  4.186895 1.565067 0.148134
