program: Gaussian 09
title: 000028889
version: EM64L-G09RevD.01
frameworkgroup: C1[X(C21H28N2O)]
method: RPBEPBE
basis: SDD
operation: Freq
keyword: #p
keyword: freq=noraman
keyword: PBEPBE/SDD
title: #p freq=noraman PBEPBE/SDD
converged: YES YES NO NO
title: Mulliken charges:
elementType: O N N C C C C C C C C C C C C C C C C C C C C C H H H H H H H H H H H H H H H H H H H H H H H H H H H H
charge: -0.287304 -0.244604 -0.095709 -0.364596 -0.435840 0.108061 -0.356513 0.170757 0.390392 0.365710 -0.672122 -0.439120 -0.416555 -0.820728 -0.836642 0.476055 -0.234206 -0.605628 -0.656332 -0.423712 -0.388399 -0.232119 -0.222068 -0.248072 0.274025 0.205995 0.198755 0.253800 0.202956 0.188895 0.237838 0.245554 0.236832 0.234478 0.267534 0.220701 0.240740 0.260902 0.227004 0.244608 0.227146 0.221889 0.218861 0.184662 0.294461 0.213287 0.180598 0.237900 0.273545 0.225075 0.224854 0.226395
chargesum: 0.00000
title: Mulliken charges with hydrogens summed into heavy atoms:
elementType: O N N C C C C C C C C C C C C C C C C C C C C C
charge: -0.287304 -0.244604 -0.095709 0.115424 0.016715 0.108061 0.035338 0.170757 0.390392 0.365710 -0.188729 -0.202288 -0.182077 -0.091752 -0.104128 0.476055 -0.007060 0.019785 0.032013 -0.185812 -0.114854 -0.007043 0.002786 -0.021677
polarizability: 2.50226645e+02 1.77868707e+01 2.61643473e+02 2.91136368e+01 -1.20613846e+01 1.98945946e+02
1716.lowfreq: -9.5327 -0.0003 0.0002 0.0005 0.8712 10.8737 18.4366 29.3492 35.6819
frequency: 17.1333 29.2141 35.5043 41.0470 42.6703 61.7614 67.8760 75.2915 84.9737 104.7470 110.2198 112.9854 134.0693 154.2113 197.7153 214.0235 229.5824 237.3272 249.6998 252.7527 282.7077 297.7264 308.3137 321.6252 343.7815 359.6490 380.0163 401.7913 404.9101 417.0613 448.6903 468.7607 484.2464 519.4539 521.4438 538.2191 555.6920 562.9367 583.8130 616.3709 653.9126 702.9566 719.2720 738.1356 745.7608 755.0119 778.6505 782.2252 800.3623 827.6055 857.1751 872.5268 899.1169 914.4054 918.7041 927.5841 940.2646 970.2852 979.2724 979.8077 987.3538 989.4056 995.9996 1027.2931 1031.9111 1037.9484 1043.0008 1047.5329 1048.2444 1058.7130 1079.2318 1085.6352 1085.7589 1100.0457 1102.6266 1142.1270 1148.8350 1170.5020 1174.3802 1178.0386 1189.9157 1203.5535 1222.5728 1242.7755 1256.5295 1261.4909 1270.6691 1274.6910 1282.5054 1300.5151 1315.5045 1334.0205 1351.5010 1360.3651 1365.7417 1377.2143 1383.6363 1404.4999 1405.9218 1421.8165 1438.3420 1442.0084 1443.1482 1451.8273 1452.5085 1455.9778 1461.5442 1464.9971 1468.2240 1469.9859 1474.1463 1478.5165 1482.2486 1482.5581 1484.4858 1487.5830 1503.9968 1564.9406 1592.2810 1595.0607 1600.8055 1611.8771 2817.7874 2841.5764 2858.4394 2978.6822 2984.5270 2990.7884 2995.9503 3013.4780 3016.0957 3016.5972 3028.5896 3059.3389 3061.5911 3063.5147 3073.5643 3085.2194 3088.5211 3089.4229 3090.1730 3101.6991 3117.2443 3120.2595 3125.1299 3129.4038 3137.2281 3147.3884 3155.7333 3162.1131
redmass: 4.6336 4.1809 4.0915 3.0124 4.1895 1.6205 2.0281 3.0302 2.9144 1.7845 3.1298 2.0224 5.2118 2.9590 3.3455 2.0790 2.6452 1.6673 1.9835 2.1463 1.8552 2.6926 2.0721 2.7116 2.0810 2.6901 3.9578 3.6544 2.9771 2.1793 2.8438 3.0867 3.9954 4.0071 3.7369 3.6267 4.5125 4.8533 3.6763 6.1480 4.2233 2.5539 2.2952 1.7054 2.9770 3.7775 2.7585 1.3430 2.0258 3.9276 1.2459 1.9678 1.3101 1.6909 2.4212 2.9417 1.8450 2.1918 1.3467 1.3862 1.6064 5.4330 1.3486 2.3070 2.7923 1.7577 1.5401 1.6027 1.7098 2.2446 1.7515 1.7663 1.8019 1.6102 1.6538 1.4760 1.4543 1.1630 1.3804 1.1654 1.1490 2.6169 1.8494 2.2132 1.6262 2.1930 2.1214 1.8332 1.7136 1.5786 1.2353 1.2848 1.7638 5.3029 1.4544 2.4429 4.4098 1.2438 1.2368 1.1452 2.2192 2.2155 1.1391 1.1761 1.6276 1.1727 1.0555 1.0826 1.0635 1.0571 1.0903 1.0670 1.4162 1.8002 1.3063 1.0581 1.0544 6.5842 5.9463 7.5892 5.6775 6.0423 1.0704 1.0572 1.0567 1.0424 1.0371 1.0870 1.0622 1.0713 1.0598 1.0613 1.0737 1.0968 1.0913 1.0967 1.1009 1.1017 1.1009 1.1037 1.0998 1.0990 1.0856 1.0858 1.0872 1.0920 1.0923 1.0961 1.0993 1.1015
irintensity: 0.1601 0.4417 0.6393 0.2309 0.5942 0.4865 0.8528 0.3992 0.7139 0.2954 1.3325 1.1263 4.2704 0.0981 1.3612 0.8651 0.1186 0.1472 1.9143 4.6541 1.9813 1.8960 7.9642 10.7936 7.6485 4.5614 3.8944 2.5830 0.4251 1.7239 10.9730 5.9167 1.2085 3.7975 3.0220 4.1530 6.2550 5.7350 15.6012 0.6353 1.5151 22.9622 37.2009 35.6015 10.9023 2.9531 19.3401 34.3477 6.4622 5.2018 0.6582 2.0951 0.1135 2.8139 3.0636 9.5855 5.3834 20.4061 0.0223 0.4317 4.6906 0.0164 0.7596 11.7788 4.5529 1.0786 23.4678 0.2107 11.5132 11.8228 4.4910 12.1260 9.9158 26.0176 12.9138 13.0943 29.2523 3.8105 16.0493 2.0905 2.2259 1.0190 6.1220 27.9423 0.4514 17.3106 4.5834 3.8405 23.8053 73.5382 9.1168 3.4901 47.3849 1.9497 20.9159 37.7681 29.0651 30.2305 1.7447 2.3933 8.4178 23.5931 0.5656 11.1401 0.9086 13.7174 8.2941 26.8043 11.3155 5.6808 19.5427 9.8333 5.0267 35.9727 44.6309 3.0030 15.3084 249.7654 1.3570 5.0302 8.5204 13.8277 75.9391 87.2262 286.4139 26.9785 16.8645 29.4472 33.2497 39.3729 22.8272 13.1584 26.3798 7.6255 24.5382 10.7829 35.0594 13.5594 4.6779 22.4228 24.0891 9.7609 5.5406 0.3486 1.9033 23.1532 23.1463 22.1967 34.2917 26.1120
temp: 298.150 k
press: 1.00000 atm
elementType: 8 7 7 6 6 6 6 6 6 6 6 6 6 6 6 6 6 6 6 6 6 6 6 6 1 1 1 1 1 1 1 1 1 1 1 1 1 1 1 1 1 1 1 1 1 1 1 1 1 1 1 1
symmnumber: 1
zpe: 1160677.9 jmol-1
zpe.correction: 0.442079 hartree
zpe.thermalcorrener: 0.466992 hartree
zpe.thermalcorrenthalpy: 0.467936 hartree
zpe.thermalcorrgfe: 0.385273 hartree
zpe.sumelectzpe: -999.965895 hartree
zpe.sumelectthermal: -999.940982 hartree
zpe.sumelectthermalent: -999.940038 hartree
zpe.sumelectthermalfe: -1000.022701 hartree
dipole: 0.4286 2.9138 0.9073
dipole: 3.0817
quadrupole: -136.1654 -138.9831 -141.8670
quadrupole: 1.2756 3.4221 -6.0849
quadrupole: 2.8398 0.0221 -2.8618 1.2756 3.4221 -6.0849
hfenergy: -1000.4079739 hartree
pointgroup: C01 [X(C21H28N2O1)]
dipole: 0.348201 1.137193 -0.2357173 debye
polarizability: 226.9123288|-10.2445793|272.6359392|36.0478387|1.8220053|211.2677964 unknown
InChI: InChI=1S/C21H28N2O/c1-17-10-8-11-18(2)21(17)23(15-9-14-22(3)4)20(24)16-19-12-6-5-7-13-19/h5-8,10-13H,9,14-16H2,1-4H3
charge 0 multiplicity 1
52 atoms
O  0.065199 -1.936868 1.250173
N  0.674388 0.128054 0.376143
N  3.880868 -2.753019 -0.099836
C  1.963715 -0.464899 -0.091282
C  2.991322 -0.675762 1.043087
C  0.405182 1.523927 0.075752
C  4.224915 -1.470886 0.560226
C  -0.228103 -0.718429 1.012614
C  0.026753 1.876567 -1.254724
C  0.552997 2.512341 1.093325
C  -1.618243 -0.169534 1.374279
C  -0.197053 3.243267 -1.551329
C  0.315957 3.868349 0.754375
C  -0.1585 0.81625 -2.324359
C  0.924909 2.141045 2.517967
C  -2.660215 -0.52125 0.309817
C  -0.054084 4.235087 -0.55674
C  5.071724 -3.386122 -0.699669
C  3.136611 -3.685976 0.776438
C  -3.405433 0.497338 -0.335641
C  -2.90227 -1.875876 -0.039814
C  -4.380957 0.171566 -1.306543
C  -3.874259 -2.201118 -1.011411
C  -4.61947 -1.179499 -1.647241
H  1.757221 -1.442952 -0.558916
H  2.383493 0.207669 -0.860297
H  3.345507 0.299666 1.430065
H  2.497259 -1.205498 1.876552
H  4.789425 -0.862769 -0.175597
H  4.906855 -1.629756 1.438837
H  -1.601074 0.921126 1.528069
H  -1.88786 -0.652436 2.331161
H  -0.49188 3.525728 -2.568696
H  0.428602 4.637677 1.527372
H  -0.8932 0.054539 -2.00647
H  -0.518002 1.267038 -3.264681
H  0.783476 0.280737 -2.543878
H  1.693302 1.351555 2.549449
H  1.301428 3.021048 3.066778
H  0.050185 1.754053 3.076616
H  -0.229369 5.28834 -0.802897
H  4.771221 -4.292909 -1.254609
H  5.548175 -2.689093 -1.413204
H  5.84348 -3.685762 0.056275
H  2.170301 -3.247095 1.077735
H  2.922082 -4.612843 0.214681
H  3.709212 -3.965901 1.698063
H  -3.220424 1.547843 -0.079328
H  -2.315736 -2.663063 0.447495
H  -4.951777 0.970321 -1.793958
H  -4.052357 -3.250943 -1.271371
H  -5.376396 -1.433865 -2.397854
