program: Gaussian 16
title: Title Card Required
version: ES64L-G16RevC.01
frameworkgroup: C1[X(C23H26CoN3O2Si)]
method: UPBE1PBE
basis: Gen
operation: Freq
keyword: #p
keyword: freq=noraman
keyword: pbe1pbe
keyword: gen
keyword: empiricaldispersion=gd3
keyword: scrf=(solvent=methanol)
keyword: integral=grid=ultrafine
keyword: pseudo=read
keyword: scf=(intrep,xqc,maxconventionalcycles=200)
title: #p freq=noraman pbe1pbe gen empiricaldispersion=gd3 scrf=(solvent=meth
basis: NPDir=0 NMtPBC= 1 NCelOv= 1 NCel= 1 NClECP= 1 NCelD= 1
basis: NCelK= 1 NCelE2= 1 NClLst= 1 CellRange= 0.0.
basis: One-electron integrals computed using PRISM.
basis: One-electron integral symmetry used in STVInt
converged: YES YES NO YES
polarizability: 5.32246147e+02 -5.81524127e+01 4.66701839e+02 -4.29745235e+01 -5.16626562e+01 2.94225112e+02
1716.lowfreq: -112.8058 -5.0486 -0.0014 -0.0009 0.0005 3.2747 10.7359 17.1667 29.5865
frequency: -112.7389 17.0293 29.4603 33.3992 38.3397 44.3625 45.4446 55.0652 68.1220 71.6139 78.8127 84.5953 106.7421 114.7449 117.5119 123.3758 135.0836 148.2629 160.8529 170.1023 191.1783 195.6926 222.2337 222.4672 230.2397 249.6208 255.1062 263.2883 271.3180 313.8897 354.5123 361.7405 372.5443 397.0768 404.7349 417.2299 425.5424 439.0339 449.0461 461.1427 470.0142 483.1944 528.6888 538.5782 628.3324 638.8777 643.4758 649.2757 652.3353 663.4813 671.9445 688.5281 689.7647 716.5164 735.2693 740.7775 745.9944 761.8643 762.4773 764.8385 786.8587 816.1682 846.8412 850.5178 855.7626 875.3594 915.3020 917.2251 931.7493 932.9763 946.6306 995.3620 1001.2883 1005.3998 1013.6354 1017.7590 1019.8083 1024.9383 1031.5536 1032.6983 1036.3969 1039.0922 1049.0350 1058.6789 1060.8810 1069.4046 1088.0079 1091.8342 1108.1667 1108.9187 1109.7163 1130.9510 1133.9628 1142.0720 1149.3750 1175.0972 1179.0145 1183.3522 1186.4929 1190.2613 1195.3264 1202.8939 1211.9736 1221.2355 1315.9854 1324.1362 1328.0705 1333.5910 1353.2271 1359.1331 1367.5559 1374.6219 1375.7451 1395.7734 1455.2230 1468.0780 1472.1844 1473.2336 1476.4666 1487.0361 1491.5131 1494.7003 1496.9962 1501.1688 1502.9948 1512.5936 1527.7960 1531.3325 1550.6647 1643.1127 1647.6922 1653.9221 1664.6411 1665.0000 1670.2224 1677.2437 1683.8763 2111.3786 2246.4448 3055.3581 3074.4319 3140.6408 3161.3639 3163.0289 3193.0514 3198.5650 3204.2945 3214.3229 3223.1750 3227.8753 3234.4403 3239.0281 3239.7331 3243.7082 3246.3259 3256.0618 3259.2686 3260.9305 3263.1015 3266.8369 3269.9808 3874.3657
redmass: 4.9925 4.8361 3.9031 3.3468 3.9968 3.1258 4.7925 3.8567 3.9943 3.9468 4.2053 4.1474 3.6511 3.7643 1.2983 3.1509 1.7236 5.1143 3.3160 3.5276 4.6492 7.4722 4.9386 4.6980 4.9957 5.5807 5.8149 5.8793 5.5410 6.3286 5.8709 2.8351 1.5907 3.8342 3.2961 3.1970 3.4938 5.0042 4.1095 3.8228 2.0040 1.5585 3.1597 5.1360 5.9955 5.6283 1.4171 6.1732 3.8001 7.2020 6.8496 4.3578 1.2074 1.6796 3.8423 6.3446 1.6310 1.7859 4.6793 1.7272 1.1990 2.4004 1.1825 2.9448 5.7753 1.2544 1.3921 1.3512 1.1322 1.3606 1.3354 1.3920 1.3931 1.3901 2.0308 1.3472 1.5264 1.3410 1.3285 1.3319 7.2725 7.2331 7.3971 7.1384 2.7068 5.0464 2.3494 1.1149 2.7612 1.7938 2.2888 1.6038 1.5891 2.7829 1.5631 1.5958 1.2683 1.2686 1.0807 1.1553 1.1262 1.4103 1.1273 1.2773 2.0779 1.4681 1.4751 1.5543 8.2808 5.7010 1.2836 3.2354 3.7700 5.7526 2.1480 1.1333 1.1409 2.0997 1.1282 2.4013 1.0605 1.0460 2.1596 1.0525 1.0662 2.7934 2.1841 3.0602 3.2287 5.5152 6.6289 6.0824 7.3658 5.8387 5.8381 6.1493 6.9678 1.0373 1.0403 1.0307 1.0320 1.1057 1.1078 1.1060 1.0886 1.1048 1.0869 1.0900 1.0947 1.0913 1.0991 1.0892 1.0903 1.0903 1.0925 1.0944 1.0948 1.0988 1.0990 1.0938 1.0959 1.0669
irintensity: 275.3416 0.8206 2.0194 1.4426 1.8902 2.0272 0.8269 2.8405 8.1215 1.7821 8.6718 1.9099 3.6313 2.6049 1.1981 1.1007 12.7656 4.8745 1.7410 0.5379 1.9689 16.2213 24.5029 17.2799 97.9068 5.9859 27.2175 6.3720 65.5308 8.6173 5.7372 5.7342 540.3873 73.1893 60.0544 40.5175 1.8484 21.7343 25.6931 0.6183 87.1033 53.5818 9.3631 3.1358 0.7822 6.4629 34.6772 33.3555 3.5578 16.1564 21.5031 107.3234 261.2126 78.4724 209.9737 11.9025 10.6639 44.9000 15.2773 0.7444 216.0045 0.7827 262.1534 2.2122 4.6011 1.3134 0.8929 0.0280 243.7772 20.3340 17.0937 1.3807 2.2417 2.1580 79.8275 1.0458 142.8094 0.2027 0.3080 0.1636 2.4353 49.7928 21.1679 143.7085 0.2003 0.7629 6.8303 27.0167 85.6540 42.9370 58.8812 16.3163 15.2527 80.9921 3.9828 0.0300 0.4961 0.1397 0.4054 6.4728 19.5968 22.3392 2.0967 21.5275 5.5608 1.9463 3.1155 9.1366 11.0400 84.9763 40.6140 3.9009 10.3427 23.1310 16.4374 595.4886 7.5234 45.1574 24.5884 17.2542 16.3057 6.9258 160.2904 11.6533 10.7680 4.4286 6.1602 66.5167 15.0760 0.7895 37.4685 87.5069 96.3576 7.9040 42.3466 92.6952 6.5901 433.1882 259.3186 64.2496 46.8812 37.6250 30.5017 28.0600 9.4760 16.9177 2.8142 2.2694 37.9716 9.4330 26.8422 7.5897 2.9995 6.3222 9.6357 2.4930 1.4519 4.7550 1.8400 3.4622 2.3949 122.5770
temp: 298.150 k
press: 1.00000 atm
elementType: 27 6 6 6 6 6 7 1 1 1 1 6 6 7 6 1 6 6 1 1 6 6 7 6 1 6 6 1 1 1 8 6 1 1 1 6 6 6 6 6 6 1 1 1 1 1 14 1 1 1 6 1 1 1 8 1
symmnumber: 1
zpe: 1168739.6 jmol-1
zpe.correction: 0.445149 hartree
zpe.thermalcorrener: 0.474971 hartree
zpe.thermalcorrenthalpy: 0.475915 hartree
zpe.thermalcorrgfe: 0.380734 hartree
zpe.sumelectzpe: -1640.129668 hartree
zpe.sumelectthermal: -1640.099846 hartree
zpe.sumelectthermalent: -1640.098902 hartree
zpe.sumelectthermalfe: -1640.194083 hartree
dipole: 7.1746 9.1423 2.4078
dipole: 11.8682
quadrupole: -114.4364 -141.0330 -168.3850
quadrupole: -17.1268 -9.9805 -11.5782
quadrupole: 26.8484 0.2518 -27.1002 -17.1268 -9.9805 -11.5782
hfenergy: -1640.5748174 hartree
pointgroup: C01 [X(C23H26Co1N3O2Si1)]
dipole: 2.8227179 3.5968447 0.9473169 debye
polarizability: 532.2461464|-58.1524129|466.7018394|-42.9745236|-51.662656|294.2251124 unknown
InChI: InChI=1S/C15H11N3.C7H10OSi.CH4O.Co.H/c1-3-10-16-12(6-1)14-8-5-9-15(18-14)13-7-2-4-11-17-13;1-8-9-7-5-3-2-4-6-7;1-2;;/h1-11H;2-6H,9H2,1H3;2H,1H3;;/q-3;;;+3;
charge 1 multiplicity 4
56 atoms
Co 0.321604 -0.456191 0.473518
C  -2.190434 1.395805 0.537727
C  -2.918475 2.57669 0.437338
C  -2.254026 3.731753 0.044837
C  -0.891317 3.67138 -0.229259
C  -0.232269 2.45068 -0.107727
N  -0.885299 1.332216 0.268075
H  -2.785174 4.673692 -0.045725
H  -2.661861 0.465563 0.836907
H  -3.979239 2.576447 0.660669
H  -0.356909 4.565662 -0.526434
C  1.216144 2.278504 -0.370971
C  2.064292 3.280652 -0.842629
N  1.680669 1.049332 -0.125436
C  3.402464 2.967129 -1.052189
H  1.698807 4.278317 -1.052239
C  2.961449 0.727856 -0.335982
C  3.866798 1.680165 -0.803191
H  4.084325 3.726044 -1.42119
H  4.905062 1.430459 -0.984236
C  3.295161 -0.69154 -0.062983
C  4.59081 -1.200872 -0.107951
N  2.242443 -1.476981 0.228644
C  4.788441 -2.554325 0.148744
H  5.435926 -0.560488 -0.330856
C  2.433084 -2.772231 0.470821
C  3.693864 -3.359978 0.440326
H  5.789841 -2.971427 0.120411
H  1.536902 -3.34425 0.693692
H  3.806903 -4.419129 0.641975
O  -0.244913 -1.070802 -1.516595
C  -0.322757 -0.217409 -2.652753
H  -0.547055 -0.791664 -3.556568
H  -1.094272 0.547316 -2.509397
H  0.647522 0.271778 -2.768899
C  -5.080221 -0.50545 -0.81404
C  -3.886328 -1.030493 -1.308738
C  -3.023954 -1.771308 -0.486852
C  -3.415461 -2.006679 0.839759
C  -4.619764 -1.510878 1.331316
C  -5.447286 -0.744434 0.507934
H  -5.722285 0.086847 -1.459972
H  -3.618346 -0.84729 -2.347538
H  -2.753432 -2.559945 1.501127
H  -4.908254 -1.706636 2.360399
H  -6.376644 -0.338418 0.897413
Si -1.382167 -2.315583 -1.214249
H  -1.75926 -2.602815 -2.648553
H  -0.624446 -1.81557 0.755344
H  -0.800733 -3.592167 -0.730835
C  0.769631 1.274398 3.125744
H  -0.227123 1.724717 3.096751
H  1.452657 1.866333 2.516269
H  1.138139 1.24651 4.154213
O  0.7576 -0.04161 2.565489
H  0.220713 -0.623729 3.115953
