program: Gaussian 16
title: Title Card Required
version: ES64L-G16RevC.01
frameworkgroup: C1[X(C18H18CoN3O3)]
method: UB3LYP
basis: Gen
operation: Freq
keyword: #p
keyword: freq=noraman
keyword: b3lyp
keyword: gen
keyword: empiricaldispersion=gd3
keyword: scrf=(solvent=methanol)
keyword: integral=grid=ultrafine
keyword: pseudo=read
keyword: scf=(intrep,xqc,maxconventionalcycles=200)
title: #p freq=noraman b3lyp gen empiricaldispersion=gd3 scrf=(solvent=methan
basis: NPDir=0 NMtPBC= 1 NCelOv= 1 NCel= 1 NClECP= 1 NCelD= 1
basis: NCelK= 1 NCelE2= 1 NClLst= 1 CellRange= 0.0.
basis: One-electron integrals computed using PRISM.
basis: One-electron integral symmetry used in STVInt
converged: YES YES NO NO
polarizability: 4.37313324e+02 -7.69304190e-01 3.88398914e+02 5.97565124e+00 2.71957488e+01 1.67655878e+02
1716.lowfreq: -6.2958 -0.0007 0.0004 0.0005 3.9817 13.1335 22.5496 29.0965 36.2112
frequency: 22.3042 29.0683 36.0073 42.0202 45.5892 47.3113 73.5140 84.1572 88.5829 93.1902 116.8081 118.7828 132.3656 139.0609 149.1793 172.6630 188.7561 205.6618 214.0125 227.3697 257.8554 264.6751 279.7534 301.2688 332.8546 352.3949 417.7607 423.1547 438.3568 449.6086 460.8936 463.3634 479.1417 526.0949 538.7603 622.3781 643.1381 646.3609 654.4663 663.3658 674.3749 675.7649 737.7528 745.5372 754.6972 762.2327 784.1441 809.6862 845.2023 848.8601 912.3879 913.4083 929.5459 948.7166 991.7203 991.9420 1010.6930 1019.3184 1027.3670 1028.1022 1029.4124 1029.6438 1033.1206 1043.2395 1059.6131 1067.1969 1078.4326 1094.3468 1100.0296 1124.2399 1126.2706 1142.6251 1168.1821 1179.3718 1193.8537 1198.0162 1221.0637 1302.4252 1312.9459 1316.0091 1325.2565 1333.8756 1358.5220 1361.7874 1367.0694 1381.5826 1443.7805 1456.1442 1463.6349 1475.0711 1478.6182 1480.2015 1489.5974 1496.7115 1499.9976 1505.9117 1514.5077 1532.7585 1572.8143 1616.6782 1624.0917 1632.2694 1642.0401 1650.1293 1655.6748 3060.4079 3063.6148 3131.5078 3141.5314 3171.1264 3181.6005 3211.9089 3212.1472 3217.6289 3217.9251 3220.8542 3232.9704 3234.1447 3238.1936 3238.8041 3244.7863 3247.4445 3806.0348
redmass: 4.9883 2.5463 1.8806 3.0202 2.8761 3.0807 4.3642 4.6518 3.3734 3.7863 4.5277 3.4835 2.3488 5.9590 5.2893 6.3253 4.7873 2.8802 5.9256 4.8726 6.8549 6.0231 5.2138 7.2698 9.2733 6.5724 3.3712 3.4163 5.8325 4.2543 3.7492 3.7376 1.1490 3.1305 5.3898 2.5912 7.4977 3.7072 7.1237 7.3202 6.4298 7.0898 6.7554 1.8956 3.8450 1.7850 1.2004 2.2714 2.7277 6.0938 1.3549 1.3574 1.4044 7.0022 1.3983 1.3975 8.0702 1.3409 1.3348 1.3501 1.7061 4.3405 7.5384 7.5829 5.1626 1.8707 2.4002 1.0927 2.0922 1.7648 1.6076 1.6665 1.7948 1.2577 1.1472 1.1350 1.2854 2.4187 3.2122 7.6353 1.4596 2.0428 3.2493 1.2894 4.1841 1.3356 2.3831 1.1494 5.9148 1.0482 2.1937 1.1530 2.1228 1.2402 1.9848 1.0434 2.5563 2.9064 5.6052 5.7685 5.4682 6.6985 5.1332 5.4886 6.2811 1.0323 1.0365 1.1009 1.1075 1.1046 1.1051 1.0900 1.0899 1.0909 1.0909 1.0903 1.0938 1.0943 1.0978 1.0988 1.0926 1.0954 1.0669
irintensity: 0.7412 0.4380 1.9794 1.3641 1.6511 2.1304 1.5017 0.5917 3.5764 1.2614 0.1619 2.3305 4.9657 10.9633 7.2913 3.6523 15.6464 3.7865 21.2349 9.6747 20.3078 1.0055 84.6966 17.8773 75.9916 0.2346 8.1759 0.3062 2.2841 5.1441 0.3527 6.8714 187.8109 5.0350 0.0139 14.5733 0.8831 0.2345 27.8079 23.2305 70.2159 52.1857 0.1723 9.5955 5.8479 0.0282 174.5704 0.1332 2.4686 0.0568 0.3287 0.2663 0.1231 18.2396 0.3752 0.4245 140.6531 0.2273 0.0964 0.4661 14.7395 2.2918 45.1452 23.9451 0.5229 14.8262 4.9506 57.9671 6.1575 8.9196 8.9477 1.3729 0.2866 0.3483 8.2410 18.0186 19.9572 7.4735 38.1623 18.3872 1.1059 36.0832 2.6667 71.6043 34.0138 26.8808 15.9176 119.6480 436.5364 10.4128 12.9138 1.2887 172.8009 2.6971 6.8101 13.9681 123.9553 9.9838 502.5781 28.0139 48.7740 72.5300 54.6830 110.4312 2.4112 40.3751 2.7623 6.8119 30.2889 13.9101 18.3802 9.4463 9.5713 2.2173 3.6281 8.4105 1.0655 5.8380 6.9973 2.3491 5.2687 3.8612 125.2012
temp: 298.150 k
press: 1.00000 atm
elementType: 27 6 6 6 6 6 7 1 1 1 1 6 6 7 6 1 6 6 1 1 6 6 7 6 1 6 6 1 1 1 8 6 1 1 1 6 8 8 6 1 1 1 1
symmnumber: 1
zpe: 879882.7 jmol-1
zpe.correction: 0.335130 hartree
zpe.thermalcorrener: 0.359774 hartree
zpe.thermalcorrenthalpy: 0.360719 hartree
zpe.thermalcorrgfe: 0.276634 hartree
zpe.sumelectzpe: -1232.293249 hartree
zpe.sumelectthermal: -1232.268605 hartree
zpe.sumelectthermalent: -1232.267660 hartree
zpe.sumelectthermalfe: -1232.351745 hartree
dipole: -1.5164 -7.7331 3.3958
dipole: 8.5809
quadrupole: -70.8837 -103.3053 -144.7034
quadrupole: -1.0715 -2.7179 6.3760
quadrupole: 35.4138 2.9922 -38.4060 -1.0715 -2.7179 6.3760
hfenergy: -1232.628379 hartree
pointgroup: C01 [X(C18H18Co1N3O3)]
dipole: -0.5966148 -3.0424451 1.3360224 debye
polarizability: 437.3133239|-0.7693068|388.3989142|5.9756527|27.1957484|167.6558783 unknown
InChI: InChI=1S/C15H11N3.C2H3O2.CH4O.Co/c1-3-10-16-12(6-1)14-8-5-9-15(18-14)13-7-2-4-11-17-13;1-2(3)4;1-2;/h1-11H;1H3;2H,1H3;/q-3;-1;;+4
charge 1 multiplicity 4
43 atoms
Co 0.04537 0.754813 0.200372
C  3.12631 1.114387 0.05636
C  4.462236 0.716665 0.035077
C  4.746241 -0.640238 -0.108349
C  3.696285 -1.551117 -0.229587
C  2.383625 -1.077982 -0.20197
N  2.117377 0.242896 -0.05795
H  5.772717 -0.990568 -0.127056
H  2.840508 2.155053 0.169575
H  5.250405 1.454393 0.129447
H  3.903233 -2.608267 -0.341178
C  1.185715 -1.94649 -0.344389
C  1.203981 -3.322769 -0.590525
N  0.019378 -1.291144 -0.241835
C  -0.01447 -3.985282 -0.74009
H  2.135564 -3.867697 -0.674578
C  -1.161552 -1.905809 -0.409089
C  -1.215302 -3.280038 -0.660127
H  -0.027733 -5.052476 -0.932745
H  -2.159568 -3.791155 -0.797913
C  -2.334247 -0.998066 -0.316725
C  -3.659602 -1.425705 -0.409121
N  -2.029999 0.310854 -0.141104
C  -4.682531 -0.481192 -0.32085
H  -3.896214 -2.473853 -0.543876
C  -3.013463 1.214793 -0.05869
C  -4.359534 0.863278 -0.144775
H  -5.718429 -0.795669 -0.389516
H  -2.698417 2.243514 0.082705
H  -5.12593 1.626158 -0.073959
O  -0.033368 0.353873 2.319406
C  0.134681 4.571466 -1.002608
H  0.146218 4.699921 -2.084947
H  1.022375 5.037663 -0.565011
H  -0.740317 5.073994 -0.579769
C  0.101353 3.11139 -0.630443
O  0.084826 2.200303 -1.507366
O  0.089718 2.783542 0.614332
C  -0.739068 -0.757067 2.91708
H  -0.568913 -0.772505 3.995726
H  -1.80988 -0.694139 2.703096
H  -0.326823 -1.660443 2.469652
H  -0.264439 1.174822 2.7785
