program: Gaussian 16
title: Title Card Required
version: ES64L-G16RevA.03
method: RM062X
basis: def2SVP
operation: Freq
keyword: #N
keyword: Geom=AllCheck
keyword: Guess=TCheck
keyword: SCRF=Check
keyword: GenChk
keyword: RM062X/def2SVP
keyword: Freq
converged: YES YES NO YES
title: Mulliken charges:
elementType: B O O C H C H C C C H H H C H H H C H H H C H H H C C C C C C C H C H H H H N C H H H I I C C C C H C H C H H H I I
charge: -0.039522 -0.374165 -0.395111 -0.031173 0.016397 -0.114928 0.010046 -0.046726 -0.047120 0.017784 0.032036 0.017007 0.024347 0.013510 0.028256 0.028106 0.027486 0.028591 0.026472 0.011551 0.026034 0.001300 0.041449 0.023164 0.026845 0.136591 -0.189868 -0.064844 0.104929 -0.071426 -0.076269 -0.048175 0.018407 -0.071822 0.013484 0.024640 0.028147 0.003526 -0.300452 0.059980 0.094362 0.058004 0.057138 0.049716 -0.049879 0.054990 -0.084665 -0.076551 -0.035181 0.026615 -0.039368 0.027097 -0.051443 0.034025 0.033643 0.034162 0.001642 -0.052789
chargesum: -1.00000
title: Mulliken charges with hydrogens summed into heavy atoms:
elementType: B O O C C C C C C C C C C C C C C C C N C I I C C C C C C I I
charge: -0.039522 -0.374165 -0.395111 -0.014776 -0.104882 -0.046726 -0.047120 0.091173 0.097359 0.092648 0.092757 0.136591 -0.186341 -0.064844 0.104929 -0.053019 -0.062785 -0.023536 -0.043674 -0.300452 0.269484 0.049716 -0.049879 0.054990 -0.058050 -0.049454 -0.001156 -0.005725 -0.017281 0.001642 -0.052789
1716.lowfreq: -21.1553 -8.8823 -2.5218 0.0005 0.0006 0.0007 5.3875 12.3063 17.5581
frequency: -20.8967 10.7616 17.2835 19.0552 19.7609 32.3237 34.9651 37.5321 38.1696 41.8602 47.1072 50.5773 56.5308 61.6412 68.0560 77.8525 94.5482 121.9937 137.9147 146.6359 164.3054 172.6010 193.0225 198.0899 208.7903 215.8400 219.0096 230.2160 238.9393 259.1969 273.6234 282.6260 291.7083 311.9222 322.4782 327.6282 343.3109 356.6364 372.9048 376.1887 400.1204 411.5554 421.5546 452.7976 470.7079 494.0699 517.8921 536.3114 541.9115 550.1190 572.6086 589.3903 594.2112 603.7222 627.5848 653.9015 683.4723 707.8404 719.9359 725.6359 757.7427 764.4914 782.2539 789.9752 806.3769 815.4308 835.5985 858.8224 877.6493 884.2112 887.6549 895.5610 908.0970 922.8009 924.4457 930.1473 960.4214 974.6891 975.4698 983.1794 992.5872 1005.6456 1008.3866 1015.2984 1021.5057 1021.9003 1029.3702 1037.2038 1042.9006 1058.5899 1068.9407 1095.4828 1107.9685 1114.5652 1138.2040 1142.5675 1143.5034 1147.4277 1173.2302 1174.2528 1176.2500 1193.9098 1205.5768 1210.1844 1248.1468 1252.1895 1258.5482 1263.8726 1298.4401 1301.8705 1324.2652 1329.6104 1359.1988 1364.9762 1372.0483 1378.0683 1378.7356 1383.1960 1400.2866 1433.0492 1433.4013 1436.4172 1441.0748 1442.5277 1445.0924 1454.1148 1458.6548 1461.5028 1464.1078 1473.6224 1476.2223 1483.6904 1510.8060 1533.1029 1536.6858 1549.3116 1645.6399 1660.8302 1687.4553 1689.6181 1710.4823 3047.2269 3049.2270 3051.2938 3052.3729 3055.4888 3102.7732 3130.6194 3132.0922 3132.2949 3136.0956 3136.6811 3139.0829 3154.3607 3154.7165 3161.5873 3164.1823 3198.8684 3200.2766 3201.7062 3206.5515 3210.3956 3214.2197 3219.9192 3220.6649 3228.2660 3229.4127 3264.1374
redmass: 17.8850 9.3353 7.8411 9.1636 9.6342 9.8437 4.1570 14.0219 49.6836 14.7060 41.4404 9.2401 4.5783 4.1494 3.5591 4.2403 3.5092 4.5649 1.3933 3.3514 2.3716 4.6436 3.7904 3.8326 76.7215 121.4714 2.4615 1.8796 1.4026 1.4230 2.9532 2.8095 2.9042 2.6280 1.5753 1.4099 1.9938 1.7423 2.4271 2.4721 3.6621 2.6259 2.8471 3.1446 3.5092 3.2359 2.9748 3.5084 3.7834 4.9505 4.8724 5.2149 4.1798 3.4698 6.3328 5.0232 3.2915 3.8502 3.3779 1.8897 4.1416 1.2802 2.0552 2.9124 4.1035 1.5814 3.9736 2.4591 1.3363 1.5568 2.5996 3.0187 2.0584 1.7974 1.4537 2.0951 1.6099 1.8268 1.3823 1.4633 1.5716 1.6561 4.9991 1.3126 2.4578 1.8486 1.1447 1.9165 1.2961 2.0697 2.8921 1.4578 1.9824 1.7515 1.2512 1.2711 1.3780 1.0806 1.3217 1.7702 2.6923 1.8237 1.9777 3.4026 2.1166 2.5931 2.5290 2.8489 1.6095 2.7791 2.1670 1.2968 5.0434 1.3587 1.4953 3.9960 1.4867 1.4783 3.2844 1.0787 1.3084 1.0607 3.1130 1.0737 1.0627 1.0602 1.0793 1.0579 1.0575 1.0749 1.3491 2.5905 3.2921 2.6266 4.4887 6.2872 6.8616 6.4460 7.3294 6.5641 7.4663 1.0367 1.0371 1.0375 1.0373 1.0381 1.0876 1.1038 1.1058 1.1039 1.0951 1.0971 1.1024 1.1032 1.1041 1.1022 1.1026 1.0882 1.1036 1.0873 1.0883 1.0904 1.0931 1.0956 1.0961 1.0995 1.1008 1.0962
irintensity: 2.4808 0.0224 1.0845 0.4736 0.1966 1.7715 0.2154 1.1693 4.3650 0.8205 0.7899 0.2462 1.1747 0.8453 0.6802 15.8208 0.1994 11.0153 0.4786 0.6329 4.4032 14.6077 11.4816 0.4131 24.5313 14.4408 1.6866 2.3315 0.8110 0.1373 0.6513 4.6645 4.2655 1.5783 0.5955 0.4472 0.5321 0.0563 2.1743 2.9130 2.2180 0.5951 0.0467 19.6732 20.3418 6.8884 18.6252 3.9833 5.4786 19.6310 5.0395 0.7708 6.3998 0.8269 0.2381 5.6283 0.2251 6.7271 51.5400 33.6859 12.6047 19.0878 34.5891 61.9214 9.7229 58.5377 7.9482 54.4705 4.5971 0.2131 12.0040 0.0475 6.1475 49.9043 9.1822 86.7147 10.5359 35.9681 3.7806 3.9785 20.5428 16.1364 0.6640 0.0787 54.7278 23.3151 37.1926 16.2635 8.7201 9.1878 409.2747 19.5310 464.4268 73.3461 23.7503 12.7290 17.3363 1.0876 12.5423 48.7176 86.5105 108.2882 65.5638 258.2972 33.9745 58.7458 3.2049 15.1790 5.6027 1.3747 53.9356 3.7783 3.7178 45.1044 3.1113 39.0521 24.6173 34.3709 9.7340 2.7092 44.0926 4.5063 52.3375 12.1704 5.7616 3.7008 1.8730 3.2575 22.6430 5.0843 12.6284 13.1533 49.9480 66.3790 95.7141 20.1332 4.9351 2.4719 3.4123 55.2650 2.2351 23.2748 28.0557 74.1168 37.3566 45.7196 42.2381 13.7583 27.8861 11.4191 14.9669 91.3964 60.0000 23.6681 27.8653 25.8630 33.6951 8.2509 9.7795 2.0127 0.6580 6.9470 9.0895 20.7059 19.8365 16.3907 15.6046 3.5661
temp: 298.150 k
press: 1.00000 atm
elementType: 5 8 8 6 1 6 1 6 6 6 1 1 1 6 1 1 1 6 1 1 1 6 1 1 1 6 6 6 6 6 6 6 1 6 1 1 1 1 7 6 1 1 1 53 53 6 6 6 6 1 6 1 6 1 1 1 53 53
symmnumber: 1
zpe: 1197131.7 jmol-1
zpe.correction: 0.455963 hartree
zpe.thermalcorrener: 0.489650 hartree
zpe.thermalcorrenthalpy: 0.490594 hartree
zpe.thermalcorrgfe: 0.381328 hartree
zpe.sumelectzpe: -2311.763364 hartree
zpe.sumelectthermal: -2311.729677 hartree
zpe.sumelectthermalent: -2311.728733 hartree
zpe.sumelectthermalfe: -2311.837999 hartree
dipole: -6.3102 1.8876 -2.4172
dipole: 7.0160
quadrupole: -308.7293 -290.3751 -274.8303
quadrupole: 3.0816 -8.4639 -1.7457
quadrupole: -17.4178 0.9365 16.4813 3.0816 -8.4639 -1.7457
hfenergy: -2312.2193272 hartree
pointgroup: C01 [X(C23H27B1I4N1O2)]
dipole: -1.9144423 -0.4879939 -1.8161604 debye
polarizability: 652.2204093|-17.3075028|582.1467038|-44.3174255|96.7082269|471.1345992 unknown
InChI: InChI=1S/C23H27BNO2.2I2/c1-22(2)23(3,4)27-24(26-22,16-15-18-11-7-6-8-12-18)21-17-19-13-9-10-14-20(19)25(21)5;2*1-2/h6-17H,1-5H3;;
charge -1 multiplicity 1
58 atoms
B  1.94598281 -0.74665548 0.43375734
O  1.65644068 -1.68525559 1.54006838
O  1.75869959 -1.54919986 -0.80143575
C  3.45401029 -0.13615078 0.57368574
H  3.71428371 0.36602511 1.51947325
C  4.38728337 -0.1663483 -0.39305001
H  4.12613556 -0.67241342 -1.33228729
C  1.65125505 -2.90657757 -0.43514258
C  1.0226133 -2.81962968 0.99725404
C  -0.49071292 -2.58312041 0.91580427
H  -0.71642256 -1.78140926 0.19772817
H  -1.03755117 -3.49019164 0.61301993
H  -0.85782324 -2.26953978 1.90538324
C  1.30336834 -4.02594756 1.8848172
H  0.79664042 -3.8979263 2.85382298
H  0.93291316 -4.95700882 1.4274225
H  2.37921101 -4.12897817 2.0792245
C  0.78958099 -3.63969308 -1.45590503
H  0.57916516 -4.67269051 -1.13528038
H  -0.16382554 -3.11705273 -1.61306886
H  1.31279227 -3.68463923 -2.42401104
C  3.04593013 -3.54232276 -0.3946784
H  3.66144208 -3.07692796 0.38857465
H  3.00194616 -4.62752824 -0.21389764
H  3.53958648 -3.37511711 -1.36419611
C  0.92037083 0.54117478 0.48663507
C  0.18168451 0.99725576 1.56630043
C  -0.43425704 2.24464347 1.19844188
C  -0.03585098 2.49196786 -0.1498208
C  -1.26697362 3.18599013 1.840264
C  -0.46750677 3.62238314 -0.85856765
C  -1.69071724 4.30632448 1.13908729
H  -1.5826141 3.02655769 2.87400689
C  -1.29917826 4.52007759 -0.20029907
H  -0.15764059 3.79409209 -1.89095872
H  -2.33994474 5.03548479 1.62772072
H  -1.65139343 5.40967495 -0.72608642
H  0.11211382 0.48654196 2.52464062
N  0.77076579 1.45587234 -0.54170489
C  1.37978034 1.35958157 -1.85025256
H  1.75162818 0.33779182 -1.98472001
H  0.63184402 1.56894996 -2.62942537
H  2.21039162 2.07523602 -1.957227
I  -2.93732221 0.59558509 0.24022255
I  -5.21543341 -0.50120293 -0.71680738
C  5.75662409 0.38936519 -0.35424862
C  6.61981128 0.16755514 -1.44053682
C  6.24989101 1.14112044 0.72789783
C  7.92197653 0.66677218 -1.44865559
H  6.25486014 -0.41160717 -2.29259123
C  7.54916503 1.64068349 0.72241042
H  5.60283266 1.34015925 1.58429801
C  8.39514145 1.40667434 -0.3653792
H  8.56996066 0.4767354 -2.30684671
H  7.90639921 2.22199121 1.57508823
H  9.41304562 1.80070774 -0.36707112
I  -3.38745325 -3.17832853 -2.23265625
I  -2.13971426 -5.24963912 -3.43472463
