program: Gaussian 09
title: 000028847
version: EM64L-G09RevD.01
frameworkgroup: C1[X(C15H25NO4)]
method: RPBEPBE
basis: SDD
operation: Freq
keyword: #p
keyword: freq=noraman
keyword: PBEPBE/SDD
title: #p freq=noraman PBEPBE/SDD
converged: NO YES NO NO
title: Mulliken charges:
elementType: O O O O N C C C C C C C C C C C C C C C H H H H H H H H H H H H H H H H H H H H H H H H H
charge: -0.279827 -0.453334 -0.536784 -0.209008 -0.279324 -0.192906 -0.481787 -0.376256 -0.447409 0.382713 -0.420789 -0.332537 -0.487713 0.245994 -0.105140 -0.116562 0.178539 -0.729613 -0.736009 -0.722714 0.256464 0.226123 0.235724 0.242841 0.214681 0.224716 0.233671 0.215923 0.252955 0.265611 0.229899 0.250123 0.237544 0.202112 0.208955 0.209497 0.241999 0.266991 0.204076 0.209990 0.216786 0.206769 0.244405 0.364875 0.437737
chargesum: 0.00000
title: Mulliken charges with hydrogens summed into heavy atoms:
elementType: O O O O N C C C C C C C C C C C C C C C
charge: -0.279827 -0.088458 -0.099047 -0.209008 -0.279324 0.063558 -0.019939 0.081265 0.010977 0.382713 0.048090 -0.066926 -0.007690 0.245994 0.132404 0.085549 0.178539 -0.069162 -0.054952 -0.054755
polarizability: 1.99091536e+02 2.13611862e+00 1.63630471e+02 -3.54910704e+00 2.94274851e+00 1.65793981e+02
1716.lowfreq: -8.5999 -0.0005 -0.0004 0.0005 6.1775 11.6565 37.4956 49.4681 65.5733
frequency: 37.4280 49.3388 65.4933 75.4980 103.0418 111.4295 119.3970 136.4324 147.8091 161.3167 182.7911 212.4511 215.1888 218.3772 232.8409 243.8336 265.7615 283.0981 297.5943 303.7016 329.4696 344.0676 354.4473 392.2935 397.1962 414.5170 453.4925 491.9694 516.7700 523.2563 558.7091 585.1931 608.0052 635.4530 644.7065 698.8410 709.7780 725.2168 787.6985 792.8760 816.8743 837.3347 859.6123 872.4996 883.4169 895.0566 908.8823 912.1856 927.0779 943.9241 950.6031 966.2115 982.6662 989.0255 995.4422 1007.1819 1019.9732 1036.2717 1042.5546 1060.4792 1065.4857 1091.0580 1097.7803 1109.3180 1118.4534 1153.9919 1161.4458 1166.8865 1168.7802 1172.0696 1187.4759 1191.0929 1205.1175 1230.2063 1262.4043 1274.2776 1279.8470 1296.5876 1298.2674 1306.7379 1310.3205 1315.2980 1324.5576 1326.4497 1332.4567 1351.2292 1357.3328 1378.0116 1382.3421 1398.2260 1461.7150 1462.6009 1465.0973 1466.5559 1469.8912 1473.2903 1474.4772 1475.8324 1481.2565 1489.4903 1494.6622 1497.5276 1640.2346 1662.1915 2632.4989 2925.2585 2976.9050 2983.1713 2986.7146 2998.0085 2998.7951 3001.4673 3005.3035 3009.3998 3011.8162 3027.1424 3047.0250 3054.2883 3064.6723 3070.3634 3072.4614 3081.5397 3087.1925 3090.8800 3099.6026 3102.3547 3120.5229 3187.9474 3460.1232
redmass: 3.7529 2.6779 4.7731 2.6963 3.8827 3.7917 4.1921 3.9532 4.0355 3.4385 3.1055 1.3487 2.7348 1.2306 2.3760 1.1039 2.5834 3.5092 3.2601 2.8830 2.8452 3.7601 3.7652 4.1801 2.6309 3.1249 3.1190 3.4788 3.4555 3.4558 1.2810 2.9406 4.1919 3.4867 3.9396 3.5162 3.7924 4.3867 2.3610 1.6807 2.2026 2.8446 2.9669 2.5915 2.1754 2.1564 3.1993 2.3000 1.1927 2.2861 1.4979 1.5617 1.8919 2.2568 1.7529 1.8200 1.8681 2.2365 3.5564 2.7793 2.5004 2.0943 3.7801 2.1719 2.2494 2.8334 1.4212 1.4301 2.1920 1.2443 1.4621 1.5519 1.6129 1.3739 1.3413 1.3232 1.3671 1.2208 1.2831 1.3397 1.4185 1.2448 1.2548 1.3378 1.4509 1.5321 2.5767 1.2116 1.2114 1.2071 1.1116 1.0458 1.0813 1.0588 1.0546 1.0810 1.0678 1.0707 1.0473 1.0916 1.0659 1.0900 11.2605 7.3735 1.0849 1.0690 1.0373 1.0362 1.0370 1.0785 1.0825 1.0593 1.0697 1.0792 1.0675 1.0919 1.0575 1.1030 1.0990 1.0988 1.1023 1.0984 1.1056 1.0989 1.1000 1.0988 1.1094 1.0974 1.0640
irintensity: 0.1729 0.1944 3.6860 2.8971 1.0319 0.0586 2.0741 0.4815 0.2226 1.1081 0.7963 0.0790 4.4932 1.4727 0.5598 0.3416 2.8839 1.9744 3.5466 3.3604 1.9601 3.5516 15.0155 19.2726 6.6683 2.8663 6.9638 8.3432 2.8065 0.9288 104.9741 1.9645 43.5213 5.6872 25.5205 12.8543 0.3263 12.9798 4.6883 17.3180 51.8589 0.2694 7.8928 9.6031 2.2309 22.4485 84.4136 20.7671 1.5980 14.1493 4.8955 37.0746 14.1506 32.8060 13.3260 21.5643 17.2374 21.9469 67.4934 112.4128 7.5398 11.5234 41.5317 15.9321 4.9242 13.2651 15.2431 2.8241 52.4909 5.8841 14.4738 16.5394 12.0208 8.8560 1.6528 23.8551 12.0228 7.7715 0.8404 4.3561 3.9364 13.1362 0.7893 8.1826 1.2087 47.2587 0.4050 16.3636 35.1884 23.7767 13.8279 12.7608 4.2879 12.1866 4.5656 10.9589 7.0116 6.8765 6.8251 30.0863 10.1100 15.5692 129.0786 3.1678 1815.5984 44.0512 27.5671 28.6983 24.2527 16.9728 12.1923 27.6874 44.5537 25.8451 34.3801 20.3848 36.1009 17.0894 36.1192 65.6420 15.3785 26.2755 54.0606 35.3833 17.3568 14.5913 5.9248 2.5775 21.6045
temp: 298.150 k
press: 1.00000 atm
elementType: 8 8 8 8 7 6 6 6 6 6 6 6 6 6 6 6 6 6 6 6 1 1 1 1 1 1 1 1 1 1 1 1 1 1 1 1 1 1 1 1 1 1 1 1 1
symmnumber: 1
zpe: 1003414.7 jmol-1
zpe.correction: 0.382180 hartree
zpe.thermalcorrener: 0.403007 hartree
zpe.thermalcorrenthalpy: 0.403951 hartree
zpe.thermalcorrgfe: 0.334076 hartree
zpe.sumelectzpe: -940.621246 hartree
zpe.sumelectthermal: -940.600420 hartree
zpe.sumelectthermalent: -940.599476 hartree
zpe.sumelectthermalfe: -940.669351 hartree
dipole: 6.1130 -0.0122 3.2128
dipole: 6.9058
quadrupole: -113.2261 -121.2577 -122.2096
quadrupole: -1.3042 -7.6410 0.2169
quadrupole: 5.6717 -2.3599 -3.3118 -1.3042 -7.6410 0.2169
hfenergy: -941.0034267 hartree
pointgroup: C01 [X(C15H25N1O4)]
dipole: 2.3472067 -0.5067429 -1.2711035 debye
polarizability: 198.8504618|-3.7677752|165.6159705|3.510989|2.8455104|164.0495564 unknown
InChI: InChI=1S/C15H25NO4/c1-10(2)15(19,11(3)17)14(18)20-9-12-6-8-16-7-4-5-13(12)16/h6,10-11,13,17,19H,4-5,7-9H2,1-3H3
charge 0 multiplicity 1
45 atoms
O  -0.759936 1.095914 -1.234884
O  -2.66325 0.1111 1.779603
O  -0.230397 -1.010957 1.408093
O  -1.234904 2.237563 0.740695
N  2.294437 -0.57134 0.552964
C  2.019678 -0.052863 -0.84847
C  3.366705 -0.239907 -1.59992
C  3.369636 -1.617715 0.451239
C  3.867001 -1.597863 -1.034607
C  1.520141 1.359338 -0.579488
C  2.618657 0.643663 1.397481
C  1.900729 1.759994 0.663321
C  0.45395 1.987774 -1.428892
C  -2.211041 -0.040746 0.399018
C  -3.508574 -0.18361 -0.456885
C  -1.23607 -1.277342 0.364011
C  -1.39101 1.228298 0.02788
C  -3.263451 -0.597591 -1.926601
C  -4.36022 1.106273 -0.381009
C  -1.941915 -2.59917 0.698857
H  1.244903 -0.677724 -1.331602
H  4.059819 0.581866 -1.339881
H  3.247676 -0.255593 -2.69699
H  2.965478 -2.606474 0.729951
H  4.18905 -1.381468 1.154943
H  3.412797 -2.432516 -1.599713
H  4.962783 -1.706539 -1.104977
H  3.715695 0.816734 1.47691
H  2.225068 0.510178 2.42205
H  1.632093 2.70812 1.134513
H  0.630034 1.937417 -2.514536
H  0.207734 3.014256 -1.111765
H  -4.075776 -0.989343 0.049883
H  -0.76131 -1.335652 -0.63427
H  -4.235772 -0.708703 -2.441062
H  -2.728697 -1.561218 -2.010869
H  -2.67398 0.165436 -2.463579
H  -4.495041 1.421871 0.666596
H  -5.35534 0.932949 -0.830907
H  -3.881257 1.935751 -0.935728
H  -1.186495 -3.399184 0.790358
H  -2.670766 -2.895109 -0.077739
H  -2.470623 -2.507705 1.663118
H  -1.834734 0.055706 2.333493
H  0.746899 -0.947766 1.053097
