program: Gaussian 16
title: Title Card Required
version: ES64L-G16RevA.03
method: RM062X
basis: def2SVP
operation: Freq
keyword: #N
keyword: Geom=AllCheck
keyword: Guess=TCheck
keyword: SCRF=Check
keyword: GenChk
keyword: RM062X/def2SVP
keyword: Freq
converged: YES YES NO YES
title: Mulliken charges:
elementType: B O O C H C H C C C C H C H C H H H C C C H H H C H H H C H H H C H H H Br N C C C O C O H H H H C C O C H C H H
charge: 0.232626 -0.286511 -0.336636 -0.070575 0.074177 0.055889 0.062273 -0.006487 -0.023295 -0.024161 -0.039693 0.040405 -0.041303 0.022140 -0.028729 0.034515 0.036771 0.039621 -0.087903 -0.077828 0.020912 0.023984 0.038913 0.034487 0.030941 0.022387 0.039733 0.026897 0.032956 0.031725 0.032044 0.024698 0.022279 0.018955 0.061405 0.018148 -0.547373 -0.314303 0.148033 0.140224 -0.000884 -0.295280 -0.033677 -0.262143 0.076759 0.066390 0.070034 0.070658 0.099008 -0.115347 -0.278310 -0.082543 0.018449 0.089972 0.040306 0.054268
chargesum: -1.00000
title: Mulliken charges with hydrogens summed into heavy atoms:
elementType: B O O C C C C C C C C C C C C C C Br N C C C O C O C C O C C
charge: 0.232626 -0.286511 -0.336636 0.003602 0.118162 -0.006487 0.017110 -0.002021 -0.005178 -0.004532 0.010892 -0.087903 -0.077828 0.118295 0.119958 0.121422 0.120788 -0.547373 -0.314303 0.148033 0.140224 0.142265 -0.295280 0.107015 -0.262143 0.099008 -0.096898 -0.278310 -0.042236 0.144241
1716.lowfreq: -311.5354 -4.1634 -0.0071 -0.0070 -0.0064 12.2527 19.5200 31.8983 37.0549
frequency: -311.5354 31.3506 35.6842 56.9257 59.7830 68.8303 70.2923 74.1485 87.5560 95.9181 101.6675 108.2407 117.2359 127.5432 130.1040 150.0021 165.9180 172.9715 204.8098 225.8256 232.5621 242.2293 254.3180 280.1189 297.9617 300.4170 312.7389 324.7308 330.0394 338.4305 356.2047 370.5763 389.4798 411.9701 421.4248 426.0668 464.4739 481.5683 504.1322 507.8013 530.0034 550.6921 570.1226 586.5039 587.9194 591.7789 599.1192 613.0405 627.1107 627.3429 658.4106 684.0128 688.0578 714.5859 730.2446 755.6209 765.2363 783.1882 790.0706 819.0172 838.2311 854.1780 876.9487 877.4678 893.2493 900.3477 902.7122 917.7870 930.6055 933.9632 958.2062 964.1942 979.0263 980.6698 994.7652 996.8879 999.3505 1011.5941 1012.7740 1015.3937 1015.9764 1024.0726 1036.0243 1038.2155 1045.6892 1062.5661 1110.3235 1110.4309 1127.4141 1142.8416 1151.2982 1153.8281 1177.3314 1188.3307 1194.5854 1210.6141 1225.2992 1229.8610 1236.4136 1250.4055 1253.8796 1256.7273 1258.1353 1271.0534 1280.5209 1289.5617 1303.5625 1316.8943 1337.6145 1348.7186 1370.2770 1372.7545 1382.6810 1387.7875 1391.6303 1406.1882 1412.3316 1430.8581 1433.6291 1439.6108 1439.8020 1445.8445 1446.7962 1463.5552 1465.0481 1468.4845 1483.4986 1486.5530 1521.6474 1564.9824 1582.2427 1662.3675 1665.9848 1688.9636 1820.2602 1911.6537 3050.9145 3054.3130 3057.0883 3060.7094 3100.9441 3107.0740 3134.4400 3137.8418 3138.5534 3141.7998 3147.6473 3156.9383 3162.4420 3165.9582 3167.4361 3168.9229 3175.5510 3208.9092 3218.2756 3225.9182 3233.1302 3237.7129 3250.9224 3271.5231 3280.4540 3303.4139
redmass: 7.7477 5.0289 3.5775 4.9563 2.3514 4.9325 5.1375 5.2377 6.0280 5.1591 5.2437 5.0294 5.3904 7.4351 6.4345 4.6160 5.9439 4.7946 5.6040 4.5136 2.0533 2.7116 2.1057 1.2858 5.0405 3.3331 2.0796 1.5667 2.8475 2.9581 1.2759 2.1769 1.9646 2.6626 3.3007 3.4611 5.4203 4.7728 2.9142 4.2616 3.4182 3.1741 3.0884 3.3290 3.3325 3.8020 3.6802 2.8438 3.2378 4.7175 7.9250 6.2083 3.1751 1.8022 2.4854 1.5088 6.4815 3.6676 2.1257 2.0594 2.0248 1.4568 2.5552 1.2689 2.6206 2.6969 3.1844 1.4014 1.4210 1.4221 1.4848 2.4149 1.7803 1.7237 1.4136 1.5702 1.6016 1.5343 4.0176 2.3908 1.8262 1.3889 2.6833 1.9076 1.3495 2.0489 5.2960 1.4756 2.1509 1.3168 1.1237 2.9869 1.8082 2.7416 1.2545 3.1289 2.1379 1.1310 2.7098 1.7267 2.2811 2.1750 2.9011 2.5098 2.1557 2.8836 2.7322 3.3940 3.2583 1.5079 3.1938 1.3902 1.5104 1.5126 1.3128 1.8854 1.9197 1.1720 1.0876 1.0543 2.9890 1.0735 1.0550 1.0488 1.1046 1.0666 2.6374 1.0609 2.5812 3.1581 5.9140 6.6610 6.1314 6.2499 12.6737 12.7808 1.0370 1.0375 1.0373 1.0378 1.0613 1.0660 1.1038 1.0848 1.1034 1.1034 1.1040 1.1081 1.1043 1.1052 1.1038 1.1026 1.1039 1.0870 1.0913 1.0955 1.0988 1.0968 1.0916 1.0932 1.1000 1.1088
irintensity: 1201.0281 0.6023 4.3007 1.6062 0.6999 1.0980 2.5085 0.7696 0.6418 5.6881 3.4490 4.1934 1.0630 54.8905 13.7420 3.5558 3.0889 10.8578 34.5712 4.2661 4.2212 4.9360 5.2525 6.0838 22.6858 201.4561 5.2359 4.8983 21.2289 3.4180 0.2602 0.9270 1.9864 5.6994 62.3414 52.7857 38.5943 130.8390 11.6012 43.6037 2.8360 247.5844 33.5397 9.7628 40.9881 4.3151 15.9231 260.8887 7.0202 53.8431 24.2075 76.0483 11.9346 84.7814 6.2300 66.2650 9.8832 17.9244 18.6054 66.6282 29.7510 34.7363 37.7027 5.0578 10.8841 19.7060 11.4349 3.5385 1.1305 0.2170 46.5720 24.5151 10.3040 25.0898 9.2832 19.4466 8.2532 70.9366 14.0005 3.0429 7.9027 1.5237 12.7559 9.7961 1.1314 12.7982 451.2069 17.2505 12.9441 6.2691 21.0824 356.1909 73.7238 67.5696 4.2617 130.1125 51.2800 1.5712 159.8224 63.4210 40.8149 26.6029 131.9251 27.9959 50.5218 113.8016 0.9602 342.0261 13.4960 7.6202 8.1797 19.8480 21.1589 37.1855 41.4889 361.9885 365.2202 18.0025 2.4251 2.3485 13.4881 8.5881 1.6055 4.7940 3.0520 5.3552 15.1179 5.7366 138.5493 115.6851 128.6592 110.4216 4.2320 15.1535 1011.6037 121.6984 24.3331 43.4921 18.2135 67.1730 17.3148 1.6650 13.9341 92.1562 32.6574 42.6112 50.6113 0.5889 30.6407 4.6179 12.3715 19.5110 1.0588 0.6124 13.9722 9.8628 6.0780 29.2706 1.0921 1.4622 7.1420 0.1667
temp: 298.150 k
press: 1.00000 atm
elementType: 5 8 8 6 1 6 1 6 6 6 6 1 6 1 6 1 1 1 6 6 6 1 1 1 6 1 1 1 6 1 1 1 6 1 1 1 35 7 6 6 6 8 6 8 1 1 1 1 6 6 8 6 1 6 1 1
symmnumber: 1
zpe: 1187861.5 jmol-1
zpe.correction: 0.452433 hartree
zpe.thermalcorrener: 0.480429 hartree
zpe.thermalcorrenthalpy: 0.481373 hartree
zpe.thermalcorrgfe: 0.394570 hartree
zpe.sumelectzpe: -3881.927110 hartree
zpe.sumelectthermal: -3881.899114 hartree
zpe.sumelectthermalent: -3881.898170 hartree
zpe.sumelectthermalfe: -3881.984973 hartree
dipole: 2.2462 -2.0211 5.7672
dipole: 6.5108
quadrupole: -191.7655 -197.2008 -218.3608
quadrupole: 6.3952 -0.9073 5.2353
quadrupole: 10.6769 5.2416 -15.9184 6.3952 -0.9073 5.2353
hfenergy: -3882.3795429 hartree
pointgroup: C01 [X(C22H26B1Br1N1O5)]
dipole: 0.8857385 -0.7975237 2.2718009 debye
polarizability: 467.5772185|16.0792236|324.9188421|-17.7526901|-41.7171486|380.7247982 unknown
InChI: InChI=1S/C22H26BNO5.Br/c1-21(2)22(3,4)29-23(28-21,24-19(25)12-13-20(24)26)17(18-11-8-14-27-18)15-16-9-6-5-7-10-16;/h5-11,14-15,17H,12-13H2,1-4H3;
charge -1 multiplicity 1
56 atoms
B  0.68992535 -0.65818042 0.03262338
O  0.60985188 -0.75395497 -1.36414693
O  -0.10905064 -1.68370342 0.61450573
C  0.16036205 1.07691754 0.61355035
H  0.33869368 0.70643972 1.63116525
C  -1.18465538 1.49258408 0.4473996
H  -1.36655466 2.50723775 0.09966382
C  -2.29572332 0.89418142 1.20575929
C  -2.0825689 -0.08016428 2.19620706
C  -3.60298981 1.36554761 0.98937612
C  -3.15545017 -0.56651861 2.94318802
H  -1.07932476 -0.46599943 2.38140639
C  -4.67038692 0.87261216 1.73071886
H  -3.76624587 2.09949967 0.19822217
C  -4.44886941 -0.09906475 2.71124209
H  -2.97680032 -1.32057936 3.71202951
H  -5.68012696 1.24285257 1.54434033
H  -5.28533827 -0.48804867 3.29532803
C  -0.69519126 -2.45762955 -0.42891129
C  0.1849415 -2.07282891 -1.67429928
C  1.43147869 -2.95556159 -1.79546666
H  1.18403948 -3.97562524 -2.12589105
H  2.1116159 -2.49451359 -2.5246017
H  1.96429704 -3.0163458 -0.83455643
C  -0.56923306 -2.05741136 -2.99439698
H  -1.01618075 -3.04181075 -3.20512894
H  -1.34946827 -1.28587735 -2.97647004
H  0.12869461 -1.81690909 -3.8109709
C  -0.61979874 -3.93073516 -0.04193767
H  -1.26626871 -4.11289053 0.82978024
H  -0.96995092 -4.57307045 -0.86497065
H  0.40219924 -4.22665289 0.2274962
C  -2.15921451 -2.05825195 -0.59773726
H  -2.67957802 -2.18960496 0.36328055
H  -2.24651538 -1.00725141 -0.90760811
H  -2.65922281 -2.69080991 -1.34759084
Br -2.01413019 1.37194897 -2.05125781
N  2.14280018 -0.65802725 0.63001865
C  2.35972281 -0.65656224 1.99129946
C  3.33070203 -0.48228852 -0.07260666
C  3.85029182 -0.58422464 2.28397251
O  1.49268826 -0.6786752 2.83991045
C  4.48969746 -0.40406559 0.91819934
O  3.45765266 -0.3993809 -1.26763951
H  4.14986696 -1.51077457 2.79402349
H  4.02287039 0.24800004 2.97922239
H  5.22698159 -1.17469321 0.65619411
H  4.97353812 0.57399855 0.78525448
C  1.1820648 2.02129871 0.13569527
C  1.26084841 2.82585744 -0.96872868
O  2.3121142 2.15935846 0.87725109
C  2.53038303 3.49187351 -0.89126395
H  0.5009875 2.88598986 -1.7447237
C  3.12314817 3.04502983 0.24814931
H  2.94875025 4.20629066 -1.59620205
H  4.07131196 3.261623 0.73279755
