program: Gaussian 16
title: Title Card Required
version: ES64L-G16RevA.03
frameworkgroup: C1[X(C18H22BBrO2S)]
method: RM062X
basis: def2SVP
operation: Freq
keyword: #N
keyword: Geom=AllCheck
keyword: Guess=TCheck
keyword: SCRF=Check
keyword: GenChk
keyword: RM062X/def2SVP
keyword: Freq
converged: YES YES YES YES
title: Mulliken charges:
elementType: C C C C S H H H B O O C H C H C C C C H C H C H H H C C C H H H C H H H C H H H C H H H Br
charge: -0.136519 -0.024766 -0.029125 -0.240686 0.118188 0.090346 0.050053 0.048104 0.175548 -0.295274 -0.272410 0.062864 0.056522 -0.115810 0.093862 0.040413 -0.040078 -0.041980 -0.035908 0.033809 -0.035963 0.035889 -0.032125 0.043039 0.043218 0.044478 -0.121747 -0.110704 0.004352 0.054095 0.059296 0.060273 0.031867 0.053878 0.047447 0.051591 0.030693 0.052629 0.053813 0.048023 0.018782 0.054109 0.050357 0.052241 -0.126683
chargesum: -0.00000
title: Mulliken charges with hydrogens summed into heavy atoms:
elementType: C C C C S B O O C C C C C C C C C C C C C C Br
charge: -0.046174 0.025286 0.018979 -0.240686 0.118188 0.175548 -0.295274 -0.272410 0.119386 -0.021948 0.040413 -0.006269 -0.006092 0.007131 0.007255 0.012353 -0.121747 -0.110704 0.178015 0.184784 0.185158 0.175489 -0.126683
chargesum: 0.00000
1716.lowfreq: -10.3086 -6.6153 -0.0049 -0.0048 -0.0035 2.7303 22.8522 28.7329 34.5517
frequency: 22.8306 28.7149 34.4087 48.0164 50.9358 65.5303 80.2193 88.7488 110.4257 124.8016 159.2443 189.4647 207.6537 219.4315 234.3900 246.5097 257.0999 262.7888 294.1985 306.3911 321.6394 335.2253 357.6725 375.4467 391.5425 405.5806 417.1041 455.7295 490.9573 525.9331 532.2356 538.3633 567.7541 588.6966 592.8183 605.2634 626.0357 659.3132 676.4101 693.6902 712.7328 725.3318 733.3826 762.1105 800.3342 816.3577 852.5196 870.1201 871.6414 876.9812 879.7713 887.6685 922.2599 939.6392 940.8105 956.6133 962.9896 979.1947 992.3441 999.6216 1011.5642 1013.6423 1020.5753 1045.5056 1046.7279 1058.1538 1073.6974 1081.1637 1102.7566 1121.8057 1144.2353 1150.1742 1165.0570 1176.5799 1185.5097 1199.1954 1206.4575 1235.0681 1250.3531 1257.6038 1284.4744 1289.1712 1311.3895 1323.1603 1350.6515 1368.9206 1383.5792 1386.8713 1393.3757 1393.8527 1398.1159 1398.6721 1423.1301 1436.8041 1440.3731 1444.2468 1452.4305 1456.4220 1466.3950 1467.6687 1477.7267 1490.9743 1520.1602 1536.7222 1616.7278 1675.9301 1694.8742 3062.8410 3065.2905 3071.4999 3073.0345 3097.7191 3154.7394 3157.9170 3158.9373 3160.3112 3160.6377 3167.0123 3169.5734 3181.0257 3181.5022 3205.4424 3207.9037 3217.8588 3226.1817 3234.8434 3237.3641 3249.1507 3275.9261
redmass: 5.5187 4.4748 4.9598 4.2223 5.7806 5.5912 5.3347 6.9532 3.8936 5.1375 5.5512 7.6484 3.3673 3.5029 1.4641 1.2386 4.7749 6.5245 2.2031 2.0576 1.1492 1.0938 2.3107 2.0916 2.5145 3.4867 2.8634 4.1759 2.8765 4.4335 3.3521 3.3645 5.9463 6.0427 3.8106 3.6059 6.1232 8.3629 3.9460 4.0843 4.3382 1.5343 1.1743 6.7110 2.2863 4.4646 4.6223 3.2696 2.8351 1.2679 1.7622 2.3250 2.5174 1.4651 1.4039 1.3587 1.4883 1.6546 1.6257 1.3536 4.3614 1.6727 1.3823 1.4695 1.3488 2.1443 2.5775 1.2682 1.4722 2.0249 2.3877 1.0914 1.3685 1.1038 2.7865 2.7152 1.2666 1.8615 1.6246 2.8084 2.3493 2.4408 2.8031 1.4642 1.8322 3.4161 2.4052 1.8194 1.4643 1.4186 2.2973 1.7585 4.1313 1.0805 1.0602 1.0607 1.0867 1.0636 1.0865 1.1357 1.0769 2.5195 7.3467 2.6918 5.9531 6.5577 6.6369 1.0369 1.0367 1.0378 1.0381 1.0857 1.1052 1.1051 1.1046 1.1042 1.0884 1.1045 1.1048 1.1041 1.1040 1.0891 1.0909 1.0918 1.0965 1.1010 1.0919 1.0965 1.1015
irintensity: 0.4539 0.2033 0.8825 0.0530 0.0794 0.2728 0.1627 0.3714 0.0565 0.4518 1.2308 1.8878 0.0580 0.9762 0.0680 0.0266 0.1114 5.0079 0.6205 0.1595 0.1128 0.2203 1.7861 0.0688 0.7273 2.1069 0.2560 6.0667 3.1508 6.4663 2.2424 12.0197 28.6624 30.8035 6.0335 14.5809 1.8816 30.9630 4.1272 29.7621 11.6432 79.5006 111.7190 0.8794 22.4996 20.8531 23.1680 4.1858 20.5125 0.3025 5.2410 58.6469 13.8918 0.9743 0.1880 1.1377 3.3582 4.9336 32.5212 0.1285 3.6026 10.4909 0.1124 5.5998 0.6942 3.8611 13.2486 13.7457 17.8534 23.0865 3.4949 0.2240 23.1497 6.3990 355.4065 49.0067 17.0600 45.9298 13.0397 36.0519 1.7257 11.0740 31.3978 16.4444 28.7134 25.8232 211.4004 158.3014 16.2284 22.0251 40.7487 57.8085 542.4393 0.2201 13.6681 1.8797 5.2611 1.9147 0.6083 25.3743 6.3760 23.8139 19.8491 11.8520 4.0109 1.2419 0.9419 9.6331 12.4327 12.6989 14.6681 2.2110 11.2394 5.0654 1.6724 41.0339 1.2707 20.5471 24.7848 10.2573 18.2414 3.2104 0.5363 1.6342 10.2572 8.0561 1.6368 3.4049 6.7197
temp: 298.150 k
press: 1.00000 atm
elementType: 6 6 6 6 16 1 1 1 5 8 8 6 1 6 1 6 6 6 6 1 6 1 6 1 1 1 6 6 6 1 1 1 6 1 1 1 6 1 1 1 6 1 1 1 35
symmnumber: 1
zpe: 967880.6 jmol-1
zpe.correction: 0.368646 hartree
zpe.thermalcorrener: 0.391152 hartree
zpe.thermalcorrenthalpy: 0.392096 hartree
zpe.thermalcorrgfe: 0.314980 hartree
zpe.sumelectzpe: -3845.163206 hartree
zpe.sumelectthermal: -3845.140701 hartree
zpe.sumelectthermalent: -3845.139756 hartree
zpe.sumelectthermalfe: -3845.216872 hartree
dipole: -2.1996 2.3872 1.2457
dipole: 3.4769
quadrupole: -127.8577 -157.0797 -153.4537
quadrupole: 3.2162 -3.2778 6.6862
quadrupole: 18.2727 -10.9493 -7.3234 3.2162 -3.2778 6.6862
hfenergy: -3845.5318522 hartree
pointgroup: C01 [X(C18H22B1Br1O2S1)]
dipole: -0.9389474 0.6302526 0.7696386 debye
polarizability: 325.5639587|44.2447079|274.2264957|-15.9991861|30.0324633|288.2794008 unknown
InChI: InChI=1S/C18H22BBrO2S/c1-17(2)18(3,4)22-19(21-17)15(14-11-8-12-23-14)16(20)13-9-6-5-7-10-13/h5-12,15-16H,1-4H3
charge 0 multiplicity 1
45 atoms
C  1.55192692 3.82378193 0.80229112
C  0.7552402 3.34881616 1.8072003
C  0.18036849 2.07863874 1.49565623
C  0.55039031 1.61022936 0.25858309
S  1.61535571 2.72908897 -0.52274304
H  2.09971022 4.76426026 0.76627956
H  0.57787877 3.88891186 2.73712336
H  -0.4831663 1.52219416 2.15893861
B  -1.32371361 -0.0185502 -0.1193248
O  -1.78410429 -0.46765292 1.08537106
O  -2.31112473 0.19258213 -1.03318643
C  0.20974157 0.28406039 -0.37505742
H  0.39357885 0.33723893 -1.45920031
C  1.10280317 -0.81729133 0.22521946
H  0.85461732 -0.95480147 1.2841436
C  2.57413909 -0.5520248 0.06207436
C  3.17079971 -0.51604338 -1.20412894
C  3.33320382 -0.21280319 1.18506228
C  4.50499038 -0.14418528 -1.34244322
H  2.5854678 -0.787489 -2.08629908
C  4.66995561 0.16558979 1.04602081
H  2.86911316 -0.23196237 2.17401054
C  5.25737178 0.20187474 -0.21698705
H  4.96179362 -0.12137432 -2.33344888
H  5.25192701 0.43304322 1.92972838
H  6.30235986 0.49692286 -0.32729917
C  -3.52926327 -0.35968115 -0.47944481
C  -3.22614972 -0.35274423 1.05978644
C  -3.57774754 0.97425712 1.7233571
H  -4.66598183 1.11404217 1.78363606
H  -3.17158487 0.98055135 2.74506154
H  -3.14367628 1.82229981 1.17257031
C  -3.83211239 -1.51201604 1.8284594
H  -4.92834961 -1.49999336 1.7383523
H  -3.45585307 -2.4759422 1.46376898
H  -3.57418349 -1.42200664 2.89325955
C  -4.70380393 0.50532652 -0.89684534
H  -4.84363971 0.43440311 -1.98487724
H  -5.62659674 0.15809535 -0.40910902
H  -4.54039185 1.55904109 -0.63875413
C  -3.67120415 -1.76785747 -1.04608887
H  -3.67591054 -1.7088905 -2.14362232
H  -2.82712504 -2.40330478 -0.73995652
H  -4.60783986 -2.23936352 -0.71799399
Br 0.59775044 -2.54725791 -0.60573887
