program: Gaussian 16
title: Title Card Required
version: ES64L-G16RevA.03
frameworkgroup: C1[X(C10H16BNO4)]
method: RM062X
basis: def2SVP
operation: Freq
keyword: #N
keyword: Geom=AllCheck
keyword: Guess=TCheck
keyword: SCRF=Check
keyword: GenChk
keyword: RM062X/def2SVP
keyword: Freq
converged: YES YES YES YES
title: Mulliken charges:
elementType: B O O C C C H H H C H H H C H H H C H H H N C C C O C O H H H H
charge: 0.220653 -0.273926 -0.273927 -0.119476 -0.119477 0.016493 0.053340 0.057372 0.056222 0.028527 0.054599 0.047881 0.054579 0.028526 0.054579 0.054599 0.047881 0.016493 0.057372 0.056222 0.053340 -0.311118 0.178729 0.178729 -0.047544 -0.250320 -0.047543 -0.250319 0.102154 0.086603 0.086603 0.102154
chargesum: -0.00000
title: Mulliken charges with hydrogens summed into heavy atoms:
elementType: B O O C C C C C C N C C C O C O
charge: 0.220653 -0.273926 -0.273927 -0.119476 -0.119477 0.183426 0.185587 0.185586 0.183426 -0.311118 0.178729 0.178729 0.141213 -0.250320 0.141214 -0.250319
1716.lowfreq: -9.7890 -7.0438 -0.0008 0.0003 0.0005 12.3605 27.2512 52.6626 76.5553
frequency: 22.4576 52.4434 76.3159 88.8815 112.2482 123.2400 186.9506 221.5516 241.1933 248.1801 265.5728 305.8064 308.3695 318.9355 334.3884 366.0299 372.5930 396.7246 452.2698 476.5543 502.9058 534.8536 559.8726 563.7675 590.4004 593.0951 650.0267 678.4106 690.8730 693.3711 810.8490 829.4083 876.6722 893.1077 941.1831 942.3360 975.1786 975.8055 1000.2084 1001.8461 1019.0131 1026.4412 1044.8153 1046.0721 1145.8079 1151.9960 1184.4792 1199.5869 1227.6485 1233.5117 1260.2410 1285.2787 1288.6704 1311.4580 1318.9450 1355.6585 1386.6541 1394.3284 1394.7611 1399.6128 1407.1939 1423.5118 1426.6800 1437.2363 1438.2933 1441.9264 1445.8869 1452.6103 1458.8322 1467.6774 1469.9311 1478.5503 1880.2509 1946.6297 3066.1791 3066.6166 3072.0749 3073.7584 3106.2259 3109.1010 3158.8621 3159.0566 3160.0110 3161.0402 3169.1917 3171.2613 3171.7278 3175.8826 3181.3910 3181.5478
redmass: 5.3655 4.0574 4.5753 1.8292 3.5172 6.5116 6.4220 2.0146 1.5140 1.8777 1.7971 2.8046 2.0940 1.1654 1.1534 2.4217 2.0906 2.8036 3.8354 6.3553 2.6745 3.3878 2.1647 3.0053 3.9157 3.8619 9.1931 5.7405 6.1760 3.2608 7.9441 1.6890 3.3857 2.2163 1.4569 1.3980 2.2504 1.6634 1.3455 1.5160 2.4161 1.9501 2.3539 3.9303 2.4660 1.2978 2.9187 2.6935 5.4683 1.1658 2.8122 2.3408 2.0800 2.8528 2.0160 7.2418 1.3715 1.4209 1.4265 1.5406 1.0786 3.6870 1.1687 1.5646 1.8438 1.0694 1.1166 1.1329 1.0931 1.1200 1.2349 1.0762 12.9552 12.8565 1.0367 1.0369 1.0378 1.0381 1.0629 1.0680 1.1049 1.1048 1.1046 1.1041 1.1060 1.1051 1.1049 1.1042 1.1041 1.1041
irintensity: 0.0228 4.0232 11.5520 0.3408 0.0717 5.3072 1.4085 2.7994 0.2081 2.6184 0.4675 0.5631 0.2054 0.3067 0.0199 2.0311 0.7614 3.1425 4.1556 19.4368 1.1199 3.7742 10.0103 0.5328 7.6986 3.0638 27.7310 58.2044 58.1634 17.2372 7.6987 40.0744 13.3850 44.9019 0.8911 0.2187 0.1697 8.5518 0.4708 40.0022 7.5590 96.6956 34.2632 4.3369 2.6691 5.7781 472.2473 72.5795 310.7228 0.3153 28.0894 1.5568 0.9515 49.2765 51.9701 17.1387 49.1610 20.0168 3.5634 68.0417 11.1227 378.2581 155.4473 480.1364 597.4588 16.7534 86.2730 8.2677 2.1208 1.3280 153.5034 25.1975 1010.8489 108.7770 0.8163 20.5868 11.4516 11.6310 9.1651 1.0761 3.7244 12.2118 0.7460 41.2026 0.4823 14.3245 26.6390 0.4363 5.1998 23.2631
temp: 298.150 k
press: 1.00000 atm
elementType: 5 8 8 6 6 6 1 1 1 6 1 1 1 6 1 1 1 6 1 1 1 7 6 6 6 8 6 8 1 1 1 1
symmnumber: 1
zpe: 695682.3 jmol-1
zpe.correction: 0.264971 hartree
zpe.thermalcorrener: 0.280643 hartree
zpe.thermalcorrenthalpy: 0.281587 hartree
zpe.thermalcorrgfe: 0.221868 hartree
zpe.sumelectzpe: -770.242372 hartree
zpe.sumelectthermal: -770.226701 hartree
zpe.sumelectthermalent: -770.225756 hartree
zpe.sumelectthermalfe: -770.285475 hartree
dipole: -0.6578 -0.0000 -0.0000
dipole: 0.6578
quadrupole: -65.7068 -110.9504 -91.5450
quadrupole: -0.0001 0.0001 -0.7374
quadrupole: 23.6940 -21.5497 -2.1443 -0.0001 0.0001 -0.7374
hfenergy: -770.5073434 hartree
pointgroup: C01 [X(C10H16B1N1O4)]
dipole: 0.2588097 0.0000287 0.0001126 debye
polarizability: 175.8555959|-0.0000398|167.7985927|0.0196562|2.1968695|130.3990913 unknown
InChI: InChI=1S/C10H16BNO4/c1-9(2)10(3,4)16-11(15-9)12-7(13)5-6-8(12)14/h5-6H2,1-4H3
charge 0 multiplicity 1
32 atoms
B  -0.06310135 0.00039971 -0.00030457
O  0.67107528 0.96926919 -0.60309552
O  0.67075932 -0.96831011 0.60312794
C  2.0418866 -0.76104685 0.18677767
C  2.04188726 0.76229186 -0.18556747
C  2.27880149 1.66411375 1.02039198
H  3.32314535 1.61311638 1.3579826
H  2.05121149 2.70110414 0.73702641
H  1.62349917 1.38559214 1.85895501
C  2.9707644 1.13593376 -1.32489925
H  4.01102583 0.89085182 -1.06486019
H  2.70333613 0.61201638 -2.25099443
H  2.90882778 2.21769657 -1.50993132
C  2.96986318 -1.13449686 1.32690604
H  2.9079849 -2.21627154 1.51188849
H  4.01029783 -0.88920769 1.0677567
H  2.70153787 -0.61062987 2.25277027
C  2.28002342 -1.66282108 -1.01897669
H  2.05240167 -2.69985749 -0.73580502
H  1.62538711 -1.38443559 -1.858105
H  3.32464712 -1.61160942 -1.35566783
N  -1.53345583 0.00023945 -0.00095097
C  -2.31963637 -1.16245931 -0.04023714
C  -2.31991861 1.16277147 0.03763815
C  -3.78004942 -0.75888078 0.05653836
O  -1.88948829 -2.27826085 -0.14155015
C  -3.78016039 0.75888213 -0.06041339
O  -1.89009454 2.27866398 0.13931758
H  -4.15380095 -1.1105322 1.02935612
H  -4.34779894 -1.28022825 -0.72406603
H  -4.34870063 1.28010618 0.71969814
H  -4.15313987 1.11045799 -1.03355449
