program: Gaussian 16
title: Title Card Required
version: ES64L-G16RevA.03
method: RM062X
basis: def2SVP
operation: Freq
keyword: #N
keyword: Geom=AllCheck
keyword: Guess=TCheck
keyword: SCRF=Check
keyword: GenChk
keyword: RM062X/def2SVP
keyword: Freq
converged: YES YES YES YES
title: Mulliken charges:
elementType: C C C C S H H H B O O C H C H C C C C H C H C H H H C C C H H H C H H H C H H H C H H H C C C C C C O O Cl Cl C N C N
charge: -0.059024 0.021034 0.038681 -0.132573 0.126741 0.136163 0.091963 0.081677 0.118728 -0.356278 -0.349455 -0.172903 0.065881 0.015448 0.053986 0.020475 -0.058030 -0.066922 -0.039756 0.041763 -0.034002 0.044379 -0.035820 0.047867 0.048837 0.050867 -0.069433 -0.067346 0.002523 0.043093 0.038828 0.048656 0.011830 0.045277 0.037694 0.040162 0.012627 0.040196 0.044527 0.039094 0.003239 0.038400 0.046352 0.041194 0.228159 -0.291019 -0.257920 0.193490 -0.001483 -0.042352 -0.194621 -0.306617 -0.045241 -0.035734 -0.101186 0.016025 -0.177272 -0.080866
chargesum: -1.00000
title: Mulliken charges with hydrogens summed into heavy atoms:
elementType: C C C C S B O O C C C C C C C C C C C C C C C C C C C C O O Cl Cl C N C N
charge: 0.077139 0.112997 0.120359 -0.132573 0.126741 0.118728 -0.356278 -0.349455 -0.107022 0.069434 0.020475 -0.016267 -0.022543 0.008111 0.014835 0.015047 -0.069433 -0.067346 0.133099 0.134963 0.136443 0.129185 0.228159 -0.291019 -0.257920 0.193490 -0.001483 -0.042352 -0.194621 -0.306617 -0.045241 -0.035734 -0.101186 0.016025 -0.177272 -0.080866
1716.lowfreq: -243.6709 -8.0915 -4.8341 -0.0010 -0.0005 0.0017 3.3667 12.3330 15.8657
frequency: -243.6709 11.0047 15.7927 21.6361 27.2190 32.7116 33.8347 47.0386 53.4617 58.8939 75.9035 87.2541 92.6448 105.7614 115.7256 127.1771 131.6427 133.8052 151.1740 161.0140 188.8552 205.8194 212.2272 217.7818 223.3382 232.3568 240.9384 262.0882 267.8005 272.5246 276.4951 302.6553 307.0490 320.2591 324.0045 326.2092 353.4683 356.4889 363.3853 366.8271 371.7397 398.0446 414.8489 420.0815 423.3938 455.0254 459.5645 466.2732 477.1903 495.5806 502.2017 519.0842 524.5368 533.0096 540.2187 554.2999 587.8360 591.4370 611.7029 621.5139 625.6091 666.0247 686.8053 697.5898 715.1862 726.9655 736.2374 768.5563 774.8707 783.9439 793.2854 796.0880 824.1638 841.2894 856.4701 871.7890 879.2043 884.0264 889.3650 903.1436 928.5475 929.6759 939.4416 954.8143 969.2406 975.0972 991.9988 995.0957 996.2102 1009.5009 1010.3372 1014.2693 1020.8854 1027.1409 1048.8503 1050.6233 1056.8042 1069.2131 1093.0089 1105.0850 1109.9856 1147.2193 1152.2727 1156.7319 1166.3532 1177.5095 1182.6706 1199.9826 1220.9856 1230.3127 1246.9715 1262.4068 1265.2361 1268.3856 1288.6478 1300.0266 1301.2366 1316.0204 1317.4682 1331.5018 1361.0250 1370.9653 1378.2295 1384.2773 1386.4678 1390.8866 1432.6678 1434.4928 1434.6879 1440.8340 1443.0651 1447.1039 1455.4270 1457.6296 1466.6649 1482.4760 1531.2042 1649.3445 1670.1921 1678.4891 1682.0445 1687.8569 1744.0948 1864.3979 2348.3415 2447.4472 3053.7495 3056.0095 3061.3071 3063.1026 3096.2568 3143.0778 3145.3649 3146.7071 3149.8151 3154.1518 3154.9288 3155.7135 3164.3758 3169.6122 3169.9353 3208.1745 3214.6491 3221.6436 3227.8910 3235.3919 3237.3033 3253.3012
redmass: 7.6856 8.3652 8.3217 4.4566 3.8648 9.7691 8.2503 3.6622 8.3981 7.0344 8.1518 17.2392 6.9403 4.7898 9.4217 11.1574 8.0738 5.2838 5.7045 7.3318 5.0049 5.2372 10.7883 4.5058 1.9394 1.5652 1.5406 2.5458 6.0929 3.1852 6.8965 1.2734 1.8957 1.4587 3.7665 3.2051 6.6793 3.1035 3.8203 3.2611 4.7624 4.8478 3.5764 2.8295 5.6964 3.6702 11.6103 10.3952 3.0972 8.6633 5.3305 8.5738 3.4285 3.5704 11.1022 5.0218 9.3182 3.9910 7.6126 5.1781 6.3547 7.5225 3.2808 4.2861 2.5169 2.4710 4.2120 5.5900 11.1521 2.0764 11.7641 11.0669 1.7262 4.0776 4.6334 2.1128 1.5702 1.8163 2.7747 10.8801 1.4595 1.4164 2.9016 4.3030 1.4512 1.5707 1.4766 1.4780 1.3637 1.9268 1.9790 2.1604 3.3581 1.3868 2.6528 1.3514 2.0508 4.9078 1.5908 1.9917 1.9383 1.0801 1.5703 3.5336 1.7548 1.1691 2.5067 3.2248 2.1531 2.8578 2.2521 2.0578 2.6667 2.6639 3.4837 2.0638 3.5374 3.2847 6.5880 1.2960 5.3697 1.3726 1.4222 1.4835 1.7523 2.3043 1.0624 10.4762 1.0595 1.0633 1.0619 1.0533 1.1023 1.0687 1.0870 2.5926 2.6159 6.6374 7.1850 6.6107 12.0248 6.5571 12.9495 13.2275 12.6748 12.7057 1.0365 1.0361 1.0377 1.0379 1.0862 1.1045 1.1045 1.1041 1.1044 1.1047 1.1043 1.0907 1.0909 1.1037 1.1036 1.0895 1.0889 1.0926 1.0972 1.1012 1.0889 1.1051
irintensity: 1185.0717 0.9179 1.5629 0.4065 0.1510 0.6689 4.1270 0.3112 0.1486 6.5049 4.6842 1.9528 2.0063 28.9150 5.4935 4.4370 9.3367 6.1596 2.5365 5.1152 5.4915 21.7761 0.8984 4.5704 1.2369 3.4829 0.4832 0.6424 0.9484 2.8152 4.4478 0.5859 1.2063 1.5003 0.2988 0.9322 7.1504 12.6379 3.6851 6.0708 6.7876 6.3799 8.2333 0.0304 27.4596 11.3401 12.1379 12.0814 7.9439 39.2033 23.6207 4.9455 6.2500 14.5046 3.8822 51.9159 12.4573 14.1422 14.2485 46.4192 0.4917 1.7166 0.6976 3.1109 104.6255 222.9734 61.0084 117.2827 17.5340 156.0382 135.4192 27.6602 120.5263 1.4009 154.4742 54.7244 29.6907 3.9192 2.8922 58.3111 4.6869 1.1654 161.6909 118.3411 1.9068 4.6533 3.6956 37.6421 26.2900 27.4854 15.1077 178.4799 86.8042 0.2697 151.9538 1.9924 11.7544 2.8428 44.5004 193.7886 80.9766 0.3167 24.8517 155.4105 48.4136 3.1684 89.2923 634.7601 91.2450 28.7022 53.5351 327.6141 8.1610 8.6666 150.4639 116.8918 90.5806 61.1840 89.5282 20.2600 8.2996 54.1103 7.2112 29.7684 32.6636 7.9604 0.4006 271.7050 9.8657 1.0803 3.1879 9.0695 1.4500 5.0903 1.5944 27.8502 30.4512 145.7613 75.9456 90.6281 256.8666 1.4317 747.0288 403.9232 475.1226 33.6311 22.0640 20.4385 23.4298 27.3674 4.0234 21.9227 6.3671 31.0721 50.4785 10.3746 80.6408 8.3508 25.6366 20.1353 28.0394 3.2168 0.7745 2.3103 11.3986 13.7029 10.1353 3.8370
temp: 298.150 k
press: 1.00000 atm
elementType: 6 6 6 6 16 1 1 1 5 8 8 6 1 6 1 6 6 6 6 1 6 1 6 1 1 1 6 6 6 1 1 1 6 1 1 1 6 1 1 1 6 1 1 1 6 6 6 6 6 6 8 8 17 17 6 7 6 7
symmnumber: 1
zpe: 1125524.5 jmol-1
zpe.correction: 0.428690 hartree
zpe.thermalcorrener: 0.462843 hartree
zpe.thermalcorrenthalpy: 0.463787 hartree
zpe.thermalcorrgfe: 0.359193 hartree
zpe.sumelectzpe: -2755.470070 hartree
zpe.sumelectthermal: -2755.435917 hartree
zpe.sumelectthermalent: -2755.434973 hartree
zpe.sumelectthermalfe: -2755.539567 hartree
dipole: -11.6446 -14.4453 6.5333
dipole: 19.6710
quadrupole: -292.5057 -255.3168 -261.0586
quadrupole: -21.3753 17.6540 12.8532
quadrupole: -22.8787 14.3102 8.5685 -21.3753 17.6540 12.8532
hfenergy: -2755.8987598 hartree
pointgroup: C01 [X(C26H22B1Cl2N2O4S1)]
dipole: 6.2153435 -3.9312837 -2.4101904 debye
polarizability: 589.5713984|-35.5348315|531.5450298|-32.3442751|-1.4430649|459.317085 unknown
InChI: InChI=1S/C26H22BCl2N2O4S/c1-24(2)25(3,4)35-27(34-24,13-12-16-8-6-5-7-9-16)19-11-10-18(36-19)26(15-31)17(14-30)22(32)20(28)21(29)23(26)33/h5-13,18H,1-4H3
charge -1 multiplicity 1
58 atoms
C  -1.22611986 -0.77910819 -0.22717014
C  -0.44297438 -0.9157664 -1.49319003
C  0.6878374 -0.19257328 -1.55687978
C  0.96554684 0.60995739 -0.37184957
S  -0.27352317 0.4111074 0.79580271
H  -1.31955871 -1.74004875 0.30547335
H  -0.79843437 -1.56125 -2.29832564
H  1.36809025 -0.17957839 -2.40951327
B  2.27586984 1.42491913 -0.0696445
O  3.05468625 1.92272847 -1.16732814
O  2.20742334 2.42924626 0.95261375
C  2.7867027 -0.10277929 0.47339544
H  2.5551906 -0.35093063 1.51675509
C  3.56110398 -0.90169865 -0.28397029
H  3.71195751 -0.62357134 -1.33479358
C  4.28095159 -2.11198079 0.14304814
C  4.16178212 -2.64902565 1.43758358
C  5.12334498 -2.75845178 -0.77643931
C  4.86495354 -3.79482751 1.79532861
H  3.51046999 -2.16607979 2.16847235
C  5.82837459 -3.90601106 -0.41713003
H  5.22124365 -2.34897488 -1.78461862
C  5.70147847 -4.42760405 0.87042918
H  4.76083178 -4.20062896 2.8032411
H  6.47826756 -4.3949713 -1.14505399
H  6.25146776 -5.32635403 1.15509463
C  3.09667803 3.47442737 0.56777422
C  3.11245198 3.33608381 -0.9927067
C  1.86426428 3.95304303 -1.62771869
H  1.88327949 5.05194076 -1.59296185
H  1.81384412 3.63984419 -2.68109703
H  0.95160165 3.60204717 -1.12090839
C  4.36552825 3.87516217 -1.66238814
H  4.49777683 4.9453156 -1.44190862
H  5.2583956 3.33109598 -1.32760905
H  4.28281506 3.75854699 -2.75336378
C  2.55785254 4.80226078 1.07646858
H  2.60344233 4.82403792 2.1756507
H  3.15736548 5.64169742 0.6924654
H  1.51171409 4.94642625 0.7763674
C  4.47112794 3.19486159 1.17669461
H  4.35691803 3.07533238 2.26422591
H  4.89493568 2.26447027 0.76982279
H  5.17862892 4.01608813 0.99063479
C  -4.17689433 -1.0819791 1.5152774
C  -3.41813067 -0.05411102 0.90839151
C  -2.70320888 -0.23629867 -0.41384565
C  -3.39193438 -1.27013974 -1.327984
C  -4.03075177 -2.41497483 -0.63440158
C  -4.36920861 -2.33535468 0.66788756
O  -3.33321802 -1.18720581 -2.5262478
O  -4.70791254 -1.04402716 2.62218655
Cl -4.37994852 -3.77927589 -1.62530258
Cl -5.14975902 -3.63641608 1.45982516
C  -2.63363013 1.03646834 -1.15403125
N  -2.55365241 2.0444448 -1.70740018
C  -3.28891588 1.15886998 1.61507942
N  -3.19942636 2.16701011 2.18967223
