program: Gaussian 16
title: Title Card Required
version: ES64L-G16RevA.03
method: RM062X
basis: def2SVP
operation: Freq
keyword: #N
keyword: Geom=AllCheck
keyword: Guess=TCheck
keyword: SCRF=Check
keyword: GenChk
keyword: RM062X/def2SVP
keyword: Freq
converged: YES YES NO YES
title: Mulliken charges:
elementType: C C C C S H H H B O O C H C H C C C C H C H C H H H C C C H H H C H H H C H H H C H H H C C C C C C O O Cl Cl C N C N
charge: -0.070074 -0.026088 0.044017 -0.330240 -0.000125 0.105742 0.061933 0.061829 0.299429 -0.353596 -0.350881 -0.019443 0.044650 -0.021613 0.032979 0.032540 -0.076108 -0.084099 -0.039202 0.043483 -0.034587 0.038607 -0.045069 0.043451 0.045053 0.045850 -0.072937 -0.078607 0.006479 0.034350 0.030701 0.050127 0.022698 0.040911 0.031803 0.037558 0.024524 0.035568 0.039744 0.031259 0.009293 0.031156 0.037513 0.036744 0.238647 -0.165643 -0.333501 0.226775 -0.017042 0.038533 -0.209676 -0.301540 -0.047395 -0.015187 -0.081836 0.017792 -0.103294 -0.043957
chargesum: -1.00000
title: Mulliken charges with hydrogens summed into heavy atoms:
elementType: C C C C S B O O C C C C C C C C C C C C C C C C C C C C O O Cl Cl C N C N
charge: 0.035668 0.035845 0.105845 -0.330240 -0.000125 0.299429 -0.353596 -0.350881 0.025207 0.011366 0.032540 -0.032625 -0.045491 0.004249 0.010466 0.000781 -0.072937 -0.078607 0.121657 0.132970 0.131095 0.114706 0.238647 -0.165643 -0.333501 0.226775 -0.017042 0.038533 -0.209676 -0.301540 -0.047395 -0.015187 -0.081836 0.017792 -0.103294 -0.043957
1716.lowfreq: -11.7985 -0.0021 -0.0012 -0.0009 2.0799 7.4891 18.9248 22.6843 29.9361
frequency: 18.8917 22.4749 29.9265 37.7341 48.5415 57.8178 61.0662 76.4681 84.1573 101.2170 108.0977 116.6441 120.6913 139.9388 146.8362 157.7289 165.6688 179.7971 193.0475 209.1601 216.6281 239.2324 241.6042 246.2686 252.9946 268.9829 273.5319 293.1160 304.5367 311.1765 316.3750 320.8798 328.2484 337.0367 343.9445 356.3356 368.4654 371.3953 380.7790 397.9202 407.4753 413.8088 418.7979 437.6098 445.5471 464.2697 479.4472 493.1020 505.0632 516.1541 527.0871 530.1241 537.5418 540.8483 554.8708 572.0049 583.9212 595.5848 627.1308 630.8670 654.8609 667.6377 685.3351 707.1225 719.2492 728.6433 743.2359 746.8690 785.0458 786.2753 801.5593 805.0286 814.3352 856.3357 863.0496 872.7810 875.7383 892.6207 894.9620 924.6156 926.0107 930.5893 933.1607 963.6777 976.5233 985.5933 989.4486 993.3672 996.5414 1001.4428 1005.6134 1008.6922 1009.5177 1022.3043 1027.7374 1044.6205 1062.2567 1085.0826 1093.1898 1098.8794 1102.7289 1116.7719 1146.5238 1175.0636 1181.6438 1182.4546 1190.5772 1209.3533 1210.7888 1219.0438 1242.2107 1254.4519 1261.8034 1268.8022 1298.2401 1303.6119 1308.0252 1317.4669 1344.6156 1346.2758 1354.4816 1363.1756 1367.6438 1376.7216 1383.3286 1387.3739 1431.4351 1435.4665 1438.7447 1443.1605 1450.3966 1455.9273 1459.4278 1460.9186 1471.2417 1485.0408 1538.0754 1628.9454 1662.4875 1681.3098 1691.6029 1711.5570 1738.1337 1843.7438 2384.5814 2447.1383 3055.7662 3058.6254 3059.7689 3063.2801 3127.5468 3140.3210 3143.5268 3145.2246 3148.0751 3162.1536 3167.2947 3170.4349 3173.0805 3184.5707 3199.1979 3205.6589 3212.5531 3215.4429 3220.0388 3226.0247 3233.4693 3234.3347
redmass: 4.1359 5.2868 5.8585 8.6025 4.7544 5.2370 6.2672 8.9134 5.1555 9.7542 6.3503 10.5597 12.4347 8.0033 7.9697 6.8915 4.4284 5.2376 5.5254 24.7933 4.0324 2.3079 1.6820 2.0940 2.9560 1.5908 5.3061 7.4683 3.8177 2.2032 1.4948 5.8818 1.9843 2.3251 2.3279 6.4855 8.8409 2.2933 2.3439 4.0551 8.0948 3.5388 2.8988 5.1750 6.0518 7.4604 5.8717 9.3161 4.6686 4.9544 3.3353 9.1283 4.6421 5.6367 5.5623 10.2435 7.1973 4.0167 6.2863 4.8549 6.9227 7.2273 3.2305 7.1201 1.7341 5.9330 8.3719 3.9834 2.2289 4.8842 2.9448 6.8585 5.3167 3.8717 7.0856 2.2145 1.5450 2.3928 2.2247 10.7495 1.5094 1.9682 1.5764 1.6140 1.6516 1.7103 2.3694 1.6260 1.2677 1.3826 1.3795 3.3020 4.0464 1.3852 4.7313 1.3439 2.0334 6.6717 5.7117 8.0268 1.4764 1.1582 1.0759 2.8178 1.3121 1.9908 1.4386 3.5800 4.1733 3.1782 1.7032 2.2804 2.9055 2.6308 7.2105 2.8112 2.1432 1.4295 1.2829 4.0004 2.3848 3.6315 1.3902 1.4360 1.4387 1.5082 1.0641 1.0575 1.0622 1.0791 1.1850 1.2665 1.2013 2.3020 1.0724 2.5826 2.6243 12.0627 6.3198 11.9595 6.5160 7.4296 6.5961 13.1600 12.6808 12.7040 1.0368 1.0372 1.0379 1.0382 1.0885 1.1046 1.1044 1.1037 1.1036 1.1041 1.1039 1.1032 1.1030 1.0916 1.0893 1.0890 1.0887 1.0874 1.0929 1.0963 1.1010 1.1032
irintensity: 0.0632 0.3137 0.0332 0.4552 0.2786 1.8608 0.8999 1.0284 1.0098 1.5976 3.8358 9.2000 2.7274 20.9281 4.7029 0.3992 0.2811 0.1035 1.7047 0.0991 2.2429 0.3020 0.1866 2.1015 0.2100 1.1232 12.4498 0.7735 6.3770 1.2250 0.5821 2.2025 0.5758 0.3233 0.8136 0.5655 5.0692 1.9539 2.0569 7.1399 3.7377 3.7459 0.2967 6.3552 6.2875 1.8147 12.3129 10.3524 7.4273 9.3191 4.6248 10.5970 40.0730 10.3039 4.8189 17.8764 34.8979 9.0728 4.5089 82.7469 2.1381 110.7108 1.1471 17.2703 55.9917 70.8356 290.8413 7.3171 30.0525 112.5362 74.4156 168.7175 48.6189 57.8238 109.4332 14.0521 8.6694 4.3202 2.1908 102.2876 12.7948 3.5086 6.2281 1.5493 13.4843 21.3333 11.6065 9.7944 15.6252 1.1783 58.8995 6.8811 8.8923 0.0116 112.5758 0.7573 14.3998 1501.8688 145.7633 47.4311 5.8993 15.7801 0.5740 56.8682 27.8651 88.6009 18.7620 318.8466 24.7798 135.8500 12.8791 74.4613 11.2127 3.5876 78.7617 4.1497 6.3590 4.1929 0.7855 18.6512 16.0197 2.1876 40.8618 16.4977 27.4366 30.7041 3.2439 3.1068 9.9070 15.5512 43.2800 31.7234 26.7284 117.2428 2.7924 12.5240 39.7275 599.8183 1.5158 49.2714 25.2911 27.5975 48.5692 624.4063 294.1421 72.1216 15.7145 31.8823 28.4711 36.7515 0.7404 1.5909 7.3579 76.3996 63.8757 18.7027 15.0706 37.6335 30.2664 11.7296 18.5455 4.8936 0.1907 0.1443 4.6372 14.6040 10.6451 0.9172
temp: 298.150 k
press: 1.00000 atm
elementType: 6 6 6 6 16 1 1 1 5 8 8 6 1 6 1 6 6 6 6 1 6 1 6 1 1 1 6 6 6 1 1 1 6 1 1 1 6 1 1 1 6 1 1 1 6 6 6 6 6 6 8 8 17 17 6 7 6 7
symmnumber: 1
zpe: 1135406.0 jmol-1
zpe.correction: 0.432453 hartree
zpe.thermalcorrener: 0.465440 hartree
zpe.thermalcorrenthalpy: 0.466384 hartree
zpe.thermalcorrgfe: 0.368219 hartree
zpe.sumelectzpe: -2755.534922 hartree
zpe.sumelectthermal: -2755.501935 hartree
zpe.sumelectthermalent: -2755.500991 hartree
zpe.sumelectthermalfe: -2755.599156 hartree
dipole: -9.0262 -0.4243 -6.4637
dipole: 11.1100
quadrupole: -270.0459 -247.7661 -264.8236
quadrupole: 13.2527 -21.9366 -6.8330
quadrupole: -9.1673 13.1124 -3.9450 13.2527 -21.9366 -6.8330
hfenergy: -2755.9673752 hartree
pointgroup: C01 [X(C26H22B1Cl2N2O4S1)]
dipole: -3.5577612 -0.2357092 -2.5283103 debye
polarizability: 580.3011527|-7.1642462|399.2528734|15.0873817|-32.8114518|484.7134427 unknown
InChI: InChI=1S/C26H22BCl2N2O4S/c1-23(2)24(3,4)35-27(34-23)25(12-10-16-8-6-5-7-9-16)13-11-18(36-25)26(15-31)17(14-30)21(33-27)19(28)20(29)22(26)32/h5-13,18H,1-4H3
charge -1 multiplicity 1
58 atoms
C  1.65989659 -2.00519214 0.92413803
C  0.69121496 -1.739188 2.0383881
C  -0.34170872 -0.95153758 1.72106804
C  -0.53257512 -0.55120973 0.28915541
S  0.73036659 -1.61392353 -0.58318894
H  2.05297244 -3.03119539 0.88246482
H  0.92445185 -2.06132416 3.05585454
H  -1.04483606 -0.57339599 2.46654098
B  -0.43378426 1.14700088 0.05040391
O  -0.84671647 1.80320509 1.25361119
O  -1.26411616 1.65266619 -1.00571088
C  -1.87662603 -0.96167859 -0.25113284
H  -2.05321218 -0.66492161 -1.28900867
C  -2.84248475 -1.59474991 0.43212696
H  -2.66825532 -1.88044963 1.47420248
C  -4.17972437 -1.94369737 -0.08390729
C  -4.61401658 -1.62057178 -1.38250065
C  -5.07220344 -2.62455679 0.7602582
C  -5.89049451 -1.97054263 -1.81459629
H  -3.94834938 -1.0897945 -2.0655682
C  -6.35071743 -2.97547836 0.3278853
H  -4.75151537 -2.88062826 1.77292387
C  -6.76638806 -2.64954909 -0.96281469
H  -6.20650565 -1.70959953 -2.8264935
H  -7.02502524 -3.50469462 1.00392825
H  -7.76665043 -2.92067389 -1.30507371
C  -2.14622374 2.64064275 -0.48750459
C  -1.47563628 3.02173791 0.88045451
C  -0.40678584 4.10769444 0.72411314
H  -0.85504492 5.09632442 0.54629328
H  0.17930715 4.15320872 1.65468463
H  0.28016307 3.87367503 -0.09991162
C  -2.45365344 3.43162431 1.97189889
H  -3.04120828 4.31015529 1.66462172
H  -3.14275658 2.6134886 2.21826148
H  -1.89682608 3.69520814 2.8837353
C  -2.24711879 3.79515964 -1.47618873
H  -2.74094117 3.44964566 -2.3970621
H  -2.84356799 4.62116365 -1.05916929
H  -1.25373488 4.17671986 -1.74559528
C  -3.52996596 2.01634423 -0.29718452
H  -3.84779056 1.56467461 -1.24946583
H  -3.50433739 1.22600477 0.46552848
H  -4.2785246 2.7675496 -0.00444626
C  2.05489919 0.82695162 -0.15227373
C  2.43408314 0.37850922 1.09494465
C  2.97650843 -1.01587549 1.13429655
C  3.97510099 -1.35508422 0.02114156
C  3.86107312 -0.5417451 -1.20388953
C  2.91527195 0.42081398 -1.30272163
O  4.74263029 -2.27869303 0.13458613
O  1.03546517 1.57224613 -0.39511291
Cl 4.90915021 -0.96617542 -2.49942628
Cl 2.64833202 1.26571427 -2.76536246
C  3.57986311 -1.3795608 2.41844304
N  4.01836303 -1.67529587 3.44281585
C  1.96911057 1.00259116 2.28332894
N  1.71203213 1.53070088 3.28316017
