program: Gaussian 09
title: 000028802
version: EM64L-G09RevD.01
frameworkgroup: C1[X(C16H27NO3)]
method: RPBEPBE
basis: SDD
operation: Freq
keyword: #p
keyword: freq=noraman
keyword: PBEPBE/SDD
title: #p freq=noraman PBEPBE/SDD
converged: YES YES NO NO
title: Mulliken charges:
elementType: O O O N C C C C C C C C C C C C C C C C H H H H H H H H H H H H H H H H H H H H H H H H H H H
charge: -0.479214 -0.287823 -0.273670 -0.414072 -0.126697 -0.201362 -0.024765 0.333085 -0.713998 0.143461 -0.665351 -0.716622 -0.514889 0.344634 -0.335216 -0.398465 -0.240554 -0.235428 -0.688778 -0.689667 0.233314 0.224941 0.268913 0.195824 0.208797 0.206671 0.253880 0.222926 0.218138 0.207399 0.211380 0.219990 0.223894 0.290680 0.358438 0.240739 0.245190 0.210520 0.200775 0.213325 0.200684 0.226014 0.231869 0.207511 0.204647 0.230728 0.228200
chargesum: 0.00000
title: Mulliken charges with hydrogens summed into heavy atoms:
elementType: O O O N C C C C C C C C C C C C C C C C
charge: -0.120777 -0.287823 -0.273670 -0.145159 0.106617 0.023579 0.171059 0.333085 -0.044649 0.143461 -0.016887 -0.061357 -0.224209 0.344634 -0.094477 -0.153275 0.170742 0.178581 -0.023385 -0.026092
polarizability: 2.27271949e+02 9.99830380e+00 2.39692915e+02 8.72815164e+00 -5.48280933e+00 1.33909807e+02
1716.lowfreq: -10.3909 -7.9333 -1.8998 -0.0003 0.0005 0.0006 15.6231 26.3221 37.5934
frequency: 15.0877 26.0282 37.5604 48.3287 62.6585 75.6487 85.6485 96.8211 104.6877 110.5759 129.6995 164.2403 178.5776 206.8825 210.9981 222.3078 229.5413 235.1543 242.4747 243.5078 246.6386 268.8559 310.6012 338.6742 354.1872 364.1423 382.9391 401.9151 424.2874 437.2072 465.7211 472.7088 500.1552 539.8791 597.5011 614.2185 622.3901 688.1342 704.4393 730.4268 768.5978 799.2462 815.4696 823.2721 831.1880 832.8853 867.9838 877.7251 897.8464 902.5975 906.3800 919.4064 925.7854 951.9809 966.9834 984.8077 999.9567 1037.7942 1039.6482 1065.6395 1091.0419 1100.4278 1115.2080 1116.4204 1119.4860 1136.4773 1136.5070 1142.6539 1161.7437 1167.5347 1184.1147 1187.3502 1239.2837 1243.9939 1260.2618 1260.9829 1274.0163 1288.8891 1303.0825 1316.9184 1333.7008 1345.4988 1360.4839 1368.3828 1379.3704 1379.8900 1386.1354 1393.7288 1397.9538 1398.7397 1405.8531 1427.0718 1441.7200 1460.3639 1460.4636 1463.4973 1465.6020 1466.0743 1470.3984 1473.5686 1477.7962 1478.3071 1483.9091 1487.2799 1490.9940 1498.3542 1594.6524 1617.4142 2894.6647 2948.3001 2951.4507 2958.4376 2974.5443 2975.4140 2982.0051 2994.2916 2994.9547 3004.9619 3008.5767 3015.3303 3066.8212 3067.0669 3079.7133 3084.2817 3089.6432 3089.8022 3091.5375 3092.1317 3102.0972 3102.8465 3134.3040 3150.0754 3167.5248 3171.5185 3412.2775
redmass: 3.5464 2.9339 3.4477 2.9151 3.4797 4.3872 3.2068 3.1632 1.7038 2.4485 2.9574 4.1737 2.9874 1.1597 2.9510 1.9861 1.9585 2.0461 1.1798 1.2091 1.1636 3.6844 4.6714 2.5968 3.4831 4.1119 3.5128 2.6856 4.4934 2.8012 2.4673 3.4342 2.6542 4.6829 4.1766 4.8134 4.6600 1.9939 3.8090 3.6947 3.8508 1.4277 1.7609 1.1536 1.1651 1.4834 1.7654 2.3660 1.5156 1.7019 2.6775 1.1919 1.3307 1.4314 2.9799 2.7771 4.5345 2.8670 2.8016 2.2618 2.6751 2.2461 2.1360 2.1507 2.0855 1.4426 1.4387 2.1542 1.7586 1.6818 2.0026 2.4111 1.9693 1.9477 1.1400 1.1434 1.4389 1.3216 1.2688 1.2415 1.3992 1.3227 1.5505 1.3257 1.9123 1.3621 1.2310 1.2198 1.2777 1.3080 1.7880 3.7239 1.2040 1.0440 1.0404 1.0525 1.0712 1.0476 1.0990 1.2860 1.0644 1.0506 1.2571 1.0563 1.0804 1.4570 8.1130 6.7479 1.0828 1.0555 1.0559 1.0832 1.0361 1.0363 1.0357 1.0360 1.0361 1.1071 1.1069 1.0854 1.1000 1.0994 1.0996 1.0996 1.0988 1.0982 1.0989 1.0989 1.1012 1.1012 1.0628 1.0870 1.0905 1.0962 1.0738
irintensity: 0.1770 0.8301 1.8575 0.5309 0.8757 0.1699 0.2796 2.7805 4.0301 2.1272 0.1758 6.1102 0.1533 0.2604 0.9997 3.5213 0.2589 0.1288 0.5030 1.5050 0.1807 0.1709 4.3826 3.2409 8.9258 2.3261 1.7795 1.0107 3.5485 1.3063 3.8832 2.0166 1.5085 1.5843 5.2121 4.0189 2.8188 16.1830 34.3476 6.0332 3.1275 54.9133 30.5004 7.3729 9.8470 47.4337 62.6561 15.1878 9.2595 19.4050 54.5064 5.0980 0.1385 2.4936 56.0071 9.7980 56.5933 39.4630 120.3293 9.0063 13.7367 5.7218 1.6250 5.3311 15.8686 1.5061 5.8313 97.8864 68.4489 25.0482 34.1496 329.7337 14.3695 19.4464 0.0381 0.0376 20.6139 34.0043 22.2445 6.9805 30.6918 5.7753 21.4256 5.5965 16.0950 26.6819 15.5964 33.5383 3.8802 72.3926 108.7571 43.6826 47.7658 7.7660 10.7266 11.7266 10.4943 1.1124 9.0787 135.6706 9.4396 0.4506 56.5631 16.9891 1.0225 44.4461 4.3891 17.6137 63.4518 59.2863 33.5230 24.7751 25.3472 35.8365 15.1636 31.2761 25.1029 34.9944 35.3884 14.5640 38.9918 33.9209 24.8979 28.6455 58.3950 40.1151 31.3903 30.5004 33.3238 38.8473 283.3571 12.2455 5.8083 11.3610 0.2849
temp: 298.150 k
press: 1.00000 atm
elementType: 8 8 8 7 6 6 6 6 6 6 6 6 6 6 6 6 6 6 6 6 1 1 1 1 1 1 1 1 1 1 1 1 1 1 1 1 1 1 1 1 1 1 1 1 1 1 1
symmnumber: 1
zpe: 1060279.1 jmol-1
zpe.correction: 0.403839 hartree
zpe.thermalcorrener: 0.427195 hartree
zpe.thermalcorrenthalpy: 0.428139 hartree
zpe.thermalcorrgfe: 0.349528 hartree
zpe.sumelectzpe: -904.713843 hartree
zpe.sumelectthermal: -904.690487 hartree
zpe.sumelectthermalent: -904.689543 hartree
zpe.sumelectthermalfe: -904.768154 hartree
dipole: 2.7810 0.9455 -2.2236
dipole: 3.6841
quadrupole: -113.7144 -100.7454 -129.9791
quadrupole: -2.9628 -1.8991 0.2965
quadrupole: 1.0985 14.0676 -15.1661 -2.9628 -1.8991 0.2965
hfenergy: -905.1176818 hartree
pointgroup: C01 [X(C16H27N1O3)]
dipole: -1.1103806 0.331216 0.8707477 debye
polarizability: 225.5659485|-10.860292|238.4353379|11.5147734|15.5351472|136.8733839 unknown
InChI: InChI=1S/C16H27NO3/c1-6-19-13-8-9-15(20-7-2)14(10-13)16(18)12(5)17-11(3)4/h8-12,16-18H,6-7H2,1-5H3
charge 0 multiplicity 1
47 atoms
O  -1.100729 -0.652948 -1.667653
O  0.200605 2.740004 0.362712
O  3.36252 -1.940715 0.428758
N  -3.271499 -0.522553 -0.212408
C  -2.042177 -0.056073 0.504275
C  -0.996563 0.349715 -0.605814
C  -4.042978 -1.63924 0.417173
C  0.431871 0.384432 -0.084246
C  -2.32406 1.060215 1.526722
C  1.017021 1.583789 0.403096
C  -3.33476 -2.988906 0.170219
C  -5.468975 -1.646216 -0.169798
C  1.199197 -0.802578 -0.087569
C  2.526075 -0.807241 0.40196
C  2.347391 1.579919 0.893027
C  3.097113 0.387565 0.896975
C  0.823912 4.028751 0.710338
C  2.817682 -3.195934 -0.119488
C  -0.233948 5.10757 0.488136
C  3.914005 -4.249935 0.01366
H  -1.622531 -0.938108 1.024482
H  -1.270803 1.354989 -0.990362
H  -3.890046 0.275507 -0.423205
H  -4.121046 -1.481296 1.519592
H  -3.063587 0.72317 2.277354
H  -2.718615 1.962343 1.021474
H  -1.402336 1.360258 2.053251
H  -2.294211 -2.976341 0.540012
H  -3.307602 -3.211901 -0.911779
H  -3.87043 -3.805754 0.687973
H  -6.005905 -0.705592 0.059405
H  -6.057834 -2.481889 0.247326
H  -5.429203 -1.765398 -1.268452
H  0.734044 -1.686377 -0.532245
H  -2.08152 -0.911504 -1.603607
H  2.811059 2.496042 1.26965
H  4.126545 0.369179 1.2675
H  1.711867 4.196711 0.066065
H  1.157229 4.009511 1.769116
H  2.530485 -3.043241 -1.180215
H  1.909466 -3.485908 0.449451
H  -1.118095 4.922177 1.122428
H  -0.558783 5.122423 -0.566254
H  0.177049 6.101464 0.743039
H  3.56053 -5.21942 -0.382546
H  4.813535 -3.948037 -0.549723
H  4.197635 -4.385226 1.071594
