program: Gaussian 09
title: 000028750
version: EM64L-G09RevD.01
frameworkgroup: C1[X(C3H5BrCl2)]
method: RPBEPBE
basis: SDD
operation: Freq
keyword: #p
keyword: freq=noraman
keyword: PBEPBE/SDD
title: #p freq=noraman PBEPBE/SDD
converged: YES YES NO NO
title: Mulliken charges:
elementType: Br Cl Cl C C C H H H H H
charge: 0.048550 0.035440 -0.033718 -0.336479 -0.515737 -0.572550 0.314102 0.291788 0.263070 0.238250 0.267284
chargesum: 0.00000
title: Mulliken charges with hydrogens summed into heavy atoms:
elementType: Br Cl Cl C C C
charge: 0.048550 0.035440 -0.033718 -0.336479 0.090152 0.196054
polarizability: 9.52708008e+01 -8.18888816e+00 5.90238224e+01 -5.40239485e+00 -1.47489250e+00 4.84212597e+01
1716.lowfreq: -11.4361 -0.0019 -0.0015 0.0016 1.1812 12.2297 101.5688 148.7835 192.7413
frequency: 101.5669 148.7829 192.7408 229.5424 269.2048 270.9284 335.4904 348.5892 526.5393 581.3685 672.8513 877.8897 910.8962 1052.4546 1059.8076 1188.4766 1229.0182 1271.5228 1394.6426 1428.9760 1453.2456 1458.0137 3002.2481 3072.5440 3100.1669 3127.1272 3165.0749
redmass: 6.4869 6.2300 13.7279 12.7407 1.0935 2.8421 2.7041 3.8432 4.9327 4.8025 6.1143 2.1645 1.8675 1.5044 1.4948 1.8863 2.0870 1.1626 1.1945 1.0881 1.0477 1.0458 1.0358 1.0573 1.0997 1.0999 1.1107
irintensity: 2.5096 4.1674 0.6629 1.1375 0.6950 3.3558 4.1176 5.3913 30.2596 122.6547 20.8935 1.1712 11.1297 25.6584 67.6919 28.4612 12.3419 2.6063 28.0739 8.6532 7.4561 13.2681 3.7897 3.2212 7.0937 4.7483 0.8064
temp: 298.150 k
press: 1.00000 atm
elementType: 35 17 17 6 6 6 1 1 1 1 1
symmnumber: 1
zpe: 194212.0 jmol-1
zpe.correction: 0.073971 hartree
zpe.thermalcorrener: 0.081668 hartree
zpe.thermalcorrenthalpy: 0.082612 hartree
zpe.thermalcorrgfe: 0.040139 hartree
zpe.sumelectzpe: -1050.410608 hartree
zpe.sumelectthermal: -1050.402911 hartree
zpe.sumelectthermalent: -1050.401967 hartree
zpe.sumelectthermalfe: -1050.444440 hartree
dipole: 0.4099 -1.4902 1.1258
dipole: 1.9121
quadrupole: -65.6980 -59.9867 -56.1298
quadrupole: -0.6181 -0.5582 1.0246
quadrupole: -5.0932 0.6181 4.4751 -0.6181 -0.5582 1.0246
hfenergy: -1050.4845793 hartree
pointgroup: C01 [X(C3H5Br1Cl2)]
dipole: -0.0815306 -0.6025305 -0.4429713 debye
dipolederiv: -0.6617469 -0.2714506 0.1513663 -0.2086218 -0.2871211 0.0912804 0.1090319 0.1043476 -0.1890526 -0.1817741 -0.0331096 -0.0031383 -0.0381021 -0.7071916 -0.1467205 -0.0237582 -0.1767337 -0.2419379 -0.6575468 -0.0465709 0.0495064 -0.0836716 -0.1541174 0.0322149 0.081034 0.0256151 -0.1775592 0.8232945 0.3531934 -0.2057618 0.2729858 1.1259764 0.0665492 -0.1349997 0.0940702 0.5435705 0.7446548 0.0939935 -0.1327042 0.1227694 -0.016336 -0.0177422 -0.0728959 -0.0193497 0.035627 -0.1574098 -0.0438205 0.086033 -0.0257224 -0.118931 0.029198 -0.0188965 0.0199262 -0.2338776 -0.0022154 -0.0321296 0.0343391 -0.0321578 0.1069767 -0.0037922 0.0067913 0.0099431 -0.0244668 -0.0318978 -0.0221981 0.0276275 -0.0204893 -0.0410036 -0.0321947 0.015576 -0.0329646 0.0982968 0.0047828 -0.0787776 0.0545685 -0.0651677 0.0901187 0.0144876 0.0623222 0.0194335 0.0599103 0.1187016 0.0061854 0.0047562 0.0002606 -0.0760672 -0.0633651 0.0183047 -0.061807 0.0448611 0.001157 0.0746845 -0.0665925 0.0779169 0.0776962 0.0300846 -0.0425098 0.0175193 0.0846283 unknown
polarizability: 88.1497062|15.171119|64.2772601|-10.1669734|-1.3822478|50.2889166 unknown
InChI: InChI=1S/C3H5BrCl2/c1-3(4,6)2-5/h2H2,1H3
charge 0 multiplicity 1
11 atoms
Br -2.084117 -0.924038 0.546512
Cl -0.381555 1.767477 0.53432
Cl 2.457833 -0.174307 0.040704
C  -0.365369 -0.003262 -0.11028
C  0.754905 -0.787225 0.576338
C  -0.36523 0.019063 -1.633381
H  0.72046 -0.674971 1.667923
H  0.717222 -1.846693 0.282652
H  0.547791 0.526384 -1.990665
H  -0.3795 -1.012227 -2.028103
H  -1.246639 0.557999 -2.01302
