program: Gaussian 09
title: 000028794
version: EM64L-G09RevD.01
frameworkgroup: C1[X(C13H17Cl2N3)]
method: RPBEPBE
basis: SDD
operation: Freq
keyword: #p
keyword: freq=noraman
keyword: PBEPBE/SDD
title: #p freq=noraman PBEPBE/SDD
converged: NO YES NO NO
title: Mulliken charges:
elementType: Cl Cl N N N C C C C C C C C C C C C C H H H H H H H H H H H H H H H H H
charge: -0.027781 -0.025392 -0.150228 -0.489150 -0.689742 -0.123775 -0.425052 -0.424891 -0.392813 -0.379064 -0.382048 0.255609 0.476053 -0.278109 -0.474319 -0.065070 -0.180212 -0.144144 0.178002 0.206563 0.181522 0.194632 0.192319 0.219034 0.193712 0.189099 0.217365 0.182730 0.199979 0.299041 0.305319 0.335993 0.345338 0.225831 0.253652
chargesum: 0.00000
title: Mulliken charges with hydrogens summed into heavy atoms:
elementType: Cl Cl N N N C C C C C C C C C C C C C
charge: -0.027781 -0.025392 -0.150228 -0.190110 -0.048430 0.054226 -0.036967 -0.037941 0.019932 0.027400 0.000661 0.255609 0.476053 0.067228 -0.248489 -0.065070 0.073440 -0.144144
polarizability: 2.48122481e+02 -9.12728073e+00 2.03436242e+02 8.39018248e+00 7.04147772e+00 1.06104838e+02
1716.lowfreq: 0.0031 0.0034 0.0035 2.6420 4.2905 12.2781 28.6365 32.3553 50.8754
frequency: 27.9290 31.5370 50.8410 77.5031 80.1143 113.4120 143.1247 181.8370 187.6192 196.1159 221.1235 235.1196 281.6824 305.8947 324.4087 340.9412 358.6382 381.8362 407.0816 429.6805 440.8555 446.4923 460.6680 479.8650 496.8891 527.4408 574.7850 613.5146 629.1893 649.1067 675.7213 691.5868 708.2960 775.1182 798.4768 798.8018 814.4506 860.8274 873.6841 878.9946 915.1206 921.9209 929.1742 937.7631 995.3254 1009.9002 1018.3216 1046.3532 1053.5554 1083.8463 1086.3050 1108.2174 1115.3687 1137.7968 1150.2314 1157.6738 1222.4935 1238.5333 1257.3399 1263.7492 1278.1071 1289.6049 1293.7484 1322.9891 1331.1133 1341.5145 1350.2794 1354.6943 1369.9647 1371.6445 1398.5656 1450.9072 1458.0516 1458.7377 1463.2715 1468.1165 1474.9392 1506.7429 1577.6902 1605.0882 1621.5174 1655.9363 2864.3139 2957.0145 2958.2943 2972.7824 2984.0160 2987.8146 3013.0226 3026.6611 3037.7053 3044.8139 3053.3743 3124.8463 3162.9443 3169.2932 3536.5706 3548.1808 3682.6442
redmass: 7.2538 4.8647 4.5164 4.0977 5.2686 4.3480 4.6612 21.5746 5.1612 4.4978 2.2906 4.8094 3.7228 2.8625 3.7141 1.4349 3.0106 2.2569 3.1003 5.2525 1.2817 3.2257 2.5539 2.2191 3.9920 1.2803 4.5966 3.9439 3.0814 6.9724 5.8980 3.6467 5.8625 1.5093 2.2794 1.7733 2.5667 2.2553 2.1587 2.8116 3.1397 1.3900 1.4488 1.3171 5.3550 2.8292 2.1752 1.5500 1.6906 2.0958 1.7866 1.9270 1.0501 2.1951 1.4426 1.7133 1.5283 1.2898 1.2737 1.3938 2.0666 2.0608 1.4814 1.5481 1.3455 1.4224 1.4415 1.4603 2.7271 1.8247 5.5320 1.0853 1.0927 1.1031 2.3704 1.0926 1.0977 2.8617 4.5882 4.8334 1.3659 3.8222 1.0813 1.0638 1.0593 1.0628 1.0627 1.0624 1.1009 1.0957 1.0982 1.1030 1.1027 1.0899 1.0928 1.0952 1.0469 1.0750 1.1013
irintensity: 0.0687 0.0509 0.2272 4.5073 0.9403 1.7413 1.9816 0.0411 0.3106 0.1160 2.9148 0.7434 0.3240 9.1988 4.2330 37.6848 0.7338 6.9440 1.2749 15.6975 209.3255 13.8379 30.2554 6.7435 26.6923 84.1483 2.7533 7.9446 4.1717 14.2801 18.5442 1.8418 10.5587 0.7615 34.7427 27.0557 5.5308 2.8850 22.3809 9.6759 3.0962 10.4988 10.7589 14.5919 19.4635 17.8979 1.8376 1.5158 7.1368 20.3763 2.0737 29.5120 1.0525 4.6476 23.8472 8.4913 5.5855 1.3556 5.7897 42.0666 6.8127 73.4207 3.7190 23.9839 1.3451 0.2367 9.6961 2.5650 146.0773 5.3426 17.5896 5.7145 4.7881 8.6722 78.8618 13.1019 22.0102 613.1091 119.8705 189.5694 35.3625 385.2548 81.3925 44.3274 43.7952 71.1942 40.2139 28.3926 54.5616 63.0028 34.5772 8.0453 141.3231 13.7830 63.5426 8.0818 23.4280 22.7713 18.0456
temp: 298.150 k
press: 1.00000 atm
elementType: 17 17 7 7 7 6 6 6 6 6 6 6 6 6 6 6 6 6 1 1 1 1 1 1 1 1 1 1 1 1 1 1 1 1 1
symmnumber: 1
zpe: 740414.9 jmol-1
zpe.correction: 0.282009 hartree
zpe.thermalcorrener: 0.299660 hartree
zpe.thermalcorrenthalpy: 0.300604 hartree
zpe.thermalcorrgfe: 0.235227 hartree
zpe.sumelectzpe: -1588.609983 hartree
zpe.sumelectthermal: -1588.592332 hartree
zpe.sumelectthermalent: -1588.591388 hartree
zpe.sumelectthermalfe: -1588.656765 hartree
dipole: -4.2123 6.0311 -0.4538
dipole: 7.3704
quadrupole: -120.5724 -102.2245 -124.3077
quadrupole: 1.4141 4.4973 -1.6133
quadrupole: -4.8709 13.4771 -8.6062 1.4141 4.4973 -1.6133
hfenergy: -1588.891992 hartree
pointgroup: C01 [X(C13H17Cl2N3)]
dipole: -1.3277876 2.5238593 0.5250352 debye
polarizability: 245.3597497|-13.1793366|198.3994291|-6.2979632|28.733339|113.9043834 unknown
InChI: InChI=1S/C13H17Cl2N3/c14-11-7-6-10(8-12(11)15)18-13(16)17-9-4-2-1-3-5-9/h6-9,18H,1-5,16H2
charge 0 multiplicity 1
35 atoms
Cl 2.160297 -2.637409 -1.363894
Cl 5.220107 -1.535493 -0.794349
N  -1.449093 0.662921 -0.162141
N  0.441589 2.027635 0.327844
N  -1.647647 3.052121 0.265996
C  -2.891449 0.524019 -0.475569
C  -3.082648 -0.695397 -1.414546
C  -3.729396 0.328445 0.826069
C  -2.751127 -2.031044 -0.710387
C  -3.394696 -1.005745 1.53399
C  -3.589124 -2.208233 0.579377
C  -0.943778 1.836245 0.114958
C  1.514146 1.150899 0.055929
C  1.329362 -0.162974 -0.451563
C  2.83623 1.617806 0.307652
C  2.45212 -0.967135 -0.713605
C  3.945967 0.793655 0.048643
C  3.761702 -0.506168 -0.469394
H  -3.27826 1.429049 -1.007357
H  -2.446823 -0.563352 -2.310186
H  -4.138707 -0.709016 -1.756229
H  -4.804186 0.337208 0.548533
H  -3.563112 1.176948 1.520957
H  -1.675795 -2.04127 -0.448293
H  -2.92684 -2.875585 -1.404355
H  -4.030418 -1.121062 2.433518
H  -2.341709 -0.978512 1.874546
H  -4.663929 -2.294529 0.311914
H  -3.308894 -3.149163 1.091228
H  0.686617 2.880261 0.83351
H  -1.215512 3.937977 0.007691
H  -2.663109 3.023774 0.299437
H  0.309361 -0.521099 -0.607877
H  3.000239 2.628711 0.700173
H  4.960114 1.155112 0.241779
