program: Gaussian 09
title: 000028753
version: EM64L-G09RevD.01
frameworkgroup: C1[X(C22H28N2O4)]
method: RPBEPBE
basis: SDD
operation: Freq
keyword: #p
keyword: freq=noraman
keyword: PBEPBE/SDD
title: #p freq=noraman PBEPBE/SDD
converged: YES YES NO NO
title: Mulliken charges:
elementType: O O O O N N C C C C C C C C C C C C C C C C C C C C C C H H H H H H H H H H H H H H H H H H H H H H H H H H H H
charge: -0.282556 -0.301432 -0.289726 -0.312364 -0.094510 -0.135249 -0.346648 -0.350311 -0.420251 -0.388963 -0.497131 0.120323 0.463978 0.371171 -0.528626 -0.466991 0.442850 -0.523579 -0.573762 -0.210737 -0.406924 0.289698 0.244864 0.040046 -0.813928 -0.526707 -0.524230 -0.524577 0.233051 0.194055 0.191452 0.213771 0.238124 0.248228 0.218821 0.259606 0.196336 0.220355 0.265478 0.235155 0.276099 0.288303 0.223331 0.231213 0.223222 0.228166 0.232976 0.231430 0.221600 0.250925 0.263788 0.211763 0.229740 0.226761 0.234782 0.257741
chargesum: 0.00000
title: Mulliken charges with hydrogens summed into heavy atoms:
elementType: O O O O N N C C C C C C C C C C C C C C C C C C C C C C
charge: -0.282556 -0.301432 -0.289726 -0.312364 -0.094510 -0.135249 0.080459 0.054911 0.066100 0.089463 -0.080439 0.120323 0.463978 0.371171 -0.263148 -0.231836 0.442850 -0.247479 -0.285459 0.012593 -0.175710 0.289698 0.244864 0.040046 -0.129564 0.177248 0.181060 0.194706
polarizability: 3.28585477e+02 8.45072926e+00 2.65172800e+02 7.74236084e+00 1.46135730e+01 2.25942337e+02
1716.lowfreq: -26.4044 -9.2458 -3.7567 -1.4159 -0.0005 -0.0004 0.0006 14.0495 17.6591
frequency: -26.3116 14.0010 17.0930 20.3744 33.5753 44.1869 53.3916 65.1577 70.8202 79.3584 90.6698 95.8442 137.7400 145.0904 156.2233 158.0985 164.7415 171.5671 173.5454 202.2324 211.7323 219.1400 239.9262 247.2398 269.0620 283.4305 291.7751 307.0900 319.4115 333.7307 355.9739 368.2456 380.3363 413.9747 429.4829 435.0815 444.8901 471.5038 506.0075 517.7689 519.8878 525.4194 570.8162 582.2071 610.8556 617.7697 640.2862 656.4668 697.8567 703.1839 732.8797 738.6884 762.0224 773.0228 790.6333 806.0490 842.7917 867.9293 890.6365 898.1962 901.3492 905.9228 914.6694 928.0578 937.8324 944.0126 980.9930 985.4556 989.0359 999.0418 1001.5443 1008.5815 1035.2137 1038.7101 1047.9455 1052.2163 1083.9665 1095.9890 1108.4978 1110.0147 1112.1593 1114.2075 1130.3285 1140.6356 1148.7900 1153.1767 1158.0507 1158.4595 1174.0161 1179.2369 1183.9431 1196.7161 1209.3565 1220.2854 1245.3653 1257.5662 1274.1009 1288.2652 1298.3493 1301.7548 1329.3049 1337.4180 1355.4250 1360.0453 1360.7294 1376.7806 1388.9502 1390.5622 1395.2830 1404.1947 1420.5996 1431.3971 1433.7644 1435.7032 1453.7421 1455.4749 1458.4260 1459.0193 1460.8838 1462.9532 1466.1242 1470.9220 1471.5741 1472.4948 1475.1680 1476.6215 1483.5349 1484.2362 1486.7971 1547.5844 1569.5486 1599.7234 1602.4773 1617.3146 2846.0687 2851.4512 2867.5555 2964.1969 2972.9619 2973.7688 2974.5129 2977.7243 2980.9395 2989.3587 3031.6465 3047.4881 3055.0341 3070.9048 3082.3545 3083.1408 3084.1176 3095.5433 3108.8372 3113.3516 3122.3635 3123.3106 3123.5589 3125.8353 3128.4754 3150.0845 3156.3834 3175.8430
redmass: 1.0508 4.3581 3.6727 4.8748 4.2543 4.9988 3.4206 3.1862 3.6709 3.1711 2.8269 2.6703 2.6159 2.0124 1.6711 1.9335 1.3725 2.0018 3.7196 3.3524 2.9783 3.8978 4.4572 4.4726 2.6747 5.6491 2.9688 3.7063 2.5489 3.2858 3.8274 5.0473 3.9036 1.9506 3.2720 4.8090 4.5909 2.8170 4.5822 4.8695 5.2534 4.4198 4.9516 4.4239 4.1909 4.4145 4.0109 3.5904 4.8170 2.3980 4.1214 5.0044 2.7082 4.4035 1.6644 4.6688 1.5633 6.2602 2.2378 1.5460 1.6441 1.3604 2.6449 1.8623 8.0460 2.2104 1.3517 4.2781 5.4636 1.7763 2.5324 1.7496 5.3781 2.5585 1.5729 1.7328 2.1189 1.8146 2.1367 1.2411 1.2751 1.2594 2.3555 3.0967 1.3767 1.3598 1.7738 1.4688 2.7748 1.0876 2.0362 1.0987 1.4457 1.5619 1.9636 2.2502 1.6386 1.7257 2.6017 1.3511 1.3241 1.3318 7.5419 1.3962 1.4377 3.4327 2.6860 2.0462 1.2642 2.1473 1.4206 2.1640 1.3227 1.3337 1.2602 1.0832 1.0674 1.1463 1.0930 1.1778 1.3488 1.5916 1.2089 1.0841 1.1361 1.0729 1.5530 1.0555 1.0582 8.5801 8.2331 5.9192 6.9570 6.3433 1.0713 1.0703 1.0696 1.0702 1.0316 1.0386 1.0343 1.0675 1.0295 1.0868 1.0893 1.0889 1.0949 1.1032 1.1026 1.1003 1.0998 1.0942 1.0915 1.0859 1.1027 1.0916 1.1036 1.0911 1.1046 1.0991 1.0916 1.0925
irintensity: 0.4670 0.1108 0.2147 0.7910 0.6638 1.6231 0.7181 1.7518 1.0808 3.3643 2.5098 9.6586 2.4053 2.6337 4.2975 2.8928 0.8314 1.0663 4.7429 1.7159 4.0436 4.1114 12.6546 2.9626 1.8628 16.1187 0.8863 3.5318 11.0210 2.4479 6.3991 2.8232 6.4737 1.4397 5.3293 6.1453 2.2270 0.2366 1.8257 0.8208 0.2488 6.0934 4.8542 4.1038 2.4116 6.5274 22.3028 1.2712 7.3023 18.6681 4.9640 24.5034 9.4598 8.3825 54.0932 9.9413 2.0900 8.9156 15.7720 5.6238 1.0349 0.9888 54.6916 9.2618 83.7747 8.8637 0.0469 107.8053 2.5150 7.6502 48.5969 3.4856 146.9251 38.3481 17.5595 0.7631 5.4040 15.5814 28.3249 9.1739 4.5968 3.9667 36.7009 16.8882 6.5106 5.5457 28.0930 21.0125 73.7464 0.6394 1.2058 4.2844 10.3219 69.4831 13.4703 6.7226 38.7938 16.6530 301.6560 23.0344 14.2246 14.2189 13.3840 8.9211 6.8753 1.8735 32.9751 31.3676 16.7671 219.1934 78.0091 4.3466 16.9504 24.3343 7.5876 0.8564 19.4836 0.9439 16.4687 3.1409 18.2577 4.7489 24.7214 15.7446 5.2746 5.9056 17.2225 20.1429 23.1112 324.1992 39.7050 5.6006 7.8207 21.8542 53.4087 39.3771 163.3448 38.9510 56.7996 33.8894 100.3600 59.5788 56.5541 19.3606 55.2423 25.3266 24.8038 26.8195 19.7232 34.0110 19.1575 7.3925 9.3249 0.3872 23.5881 26.9338 23.9539 9.1431 13.7019 31.9617 2.3802 1.1323
temp: 298.150 k
press: 1.00000 atm
elementType: 8 8 8 8 7 7 6 6 6 6 6 6 6 6 6 6 6 6 6 6 6 6 6 6 6 6 6 6 1 1 1 1 1 1 1 1 1 1 1 1 1 1 1 1 1 1 1 1 1 1 1 1 1 1 1 1
symmnumber: 1
zpe: 1207346.2 jmol-1
zpe.correction: 0.459854 hartree
zpe.thermalcorrener: 0.487830 hartree
zpe.thermalcorrenthalpy: 0.488774 hartree
zpe.thermalcorrgfe: 0.398068 hartree
zpe.sumelectzpe: -1263.385541 hartree
zpe.sumelectthermal: -1263.357564 hartree
zpe.sumelectthermalent: -1263.356620 hartree
zpe.sumelectthermalfe: -1263.447327 hartree
dipole: -0.9881 -4.4217 1.7903
dipole: 4.8716
quadrupole: -148.5421 -171.8740 -157.0974
quadrupole: -16.5274 5.5253 0.6174
quadrupole: 10.6291 -12.7028 2.0737 -16.5274 5.5253 0.6174
hfenergy: -1263.8453946 hartree
pointgroup: C01 [X(C22H28N2O4)]
dipole: -0.4455336 1.8603571 0.1187463 debye
polarizability: 327.7530893|-0.7284757|246.6632845|-14.6905651|24.1131858|245.2842405 unknown
InChI: InChI=1S/C22H28N2O4/c1-16-6-5-7-17(12-16)15-23-8-10-24(11-9-23)22(25)18-13-19(26-2)21(28-4)20(14-18)27-3/h5-7,12-14H,8-11,15H2,1-4H3
charge 0 multiplicity 1
56 atoms
O  1.645255 -3.194139 -1.121315
O  5.493833 0.15133 -1.906632
O  3.014658 1.523181 2.161785
O  5.342227 1.801686 0.456422
N  -2.847273 -1.42995 0.194973
N  -0.132508 -1.754865 -0.690549
C  -1.860192 -0.33948 0.382069
C  -2.189478 -2.759979 0.234062
C  -0.771833 -0.420971 -0.704561
C  -1.104009 -2.858275 -0.853308
C  -3.99842 -1.330992 1.12414
C  1.229377 -2.032243 -0.800481
C  -4.895204 -0.128751 0.839959
C  2.223977 -0.936338 -0.501163
C  -5.230309 0.215971 -0.49289
C  -5.443836 0.626779 1.903926
C  -6.099864 1.295972 -0.783126
C  2.120831 -0.102635 0.638281
C  3.353001 -0.827682 -1.347179
C  -6.319859 1.702594 1.632743
C  -6.647233 2.033878 0.299507
C  4.362221 0.110062 -1.060652
C  3.144723 0.821323 0.950033
C  4.290135 0.920186 0.110204
C  -6.423733 1.670284 -2.220257
C  5.731688 1.449695 -2.57848
C  3.195232 2.991687 2.118933
C  6.584814 1.104437 0.880033
H  -2.385286 0.629196 0.306118
H  -1.378696 -0.392063 1.393012
H  -1.720528 -2.963266 1.23037
H  -2.954619 -3.53818 0.053705
H  -1.252552 -0.268088 -1.693659
H  -0.016528 0.364863 -0.562321
H  -1.578734 -2.790413 -1.853436
H  -0.552526 -3.809821 -0.79201
H  -3.672737 -1.30046 2.195168
H  -4.588895 -2.261748 1.00221
H  -4.787135 -0.37144 -1.306453
H  -5.188423 0.373917 2.94066
H  1.28122 -0.18568 1.33527
H  3.460602 -1.483558 -2.215176
H  -6.745962 2.282258 2.459673
H  -7.328741 2.868948 0.095022
H  -7.414374 2.151908 -2.299898
H  -6.419232 0.78506 -2.880362
H  -5.678542 2.383688 -2.623589
H  6.652829 1.308808 -3.164074
H  4.888915 1.685693 -3.255751
H  5.861458 2.260248 -1.839427
H  4.197633 3.254631 1.744189
H  2.41663 3.451317 1.479498
H  3.066091 3.323458 3.160347
H  7.307178 1.903799 1.105347
H  6.388309 0.501687 1.78536
H  6.960026 0.459773 0.06563
