program: Gaussian 09
title: 000028785
version: EM64L-G09RevD.01
frameworkgroup: C1[X(C18H27N5O2)]
method: RPBEPBE
basis: SDD
operation: Freq
keyword: #p
keyword: freq=noraman
keyword: PBEPBE/SDD
title: #p freq=noraman PBEPBE/SDD
converged: YES YES NO NO
title: Mulliken charges:
elementType: O O N N N N N C C C C C C C C C C C C C C C C C C H H H H H H H H H H H H H H H H H H H H H H H H H H H
charge: -0.221389 -0.212393 -0.067025 -0.211962 -0.051778 -0.078083 0.017899 -0.366555 -0.356845 -0.452814 -0.443996 -0.380958 -0.510696 0.174161 -0.430638 0.296113 -0.388406 0.050767 -0.332361 -0.343875 -0.508657 0.401420 -0.382494 -0.614641 -0.626680 0.175428 0.222257 0.235640 0.176197 0.217498 0.228328 0.232853 0.209437 0.172621 0.253020 0.227164 0.266912 0.229807 0.223782 0.234509 0.226757 0.208647 0.175222 0.245286 0.304933 0.283968 0.189664 0.226939 0.224896 0.236836 0.187664 0.225620
chargesum: 0.00000
title: Mulliken charges with hydrogens summed into heavy atoms:
elementType: O O N N N N N C C C C C C C C C C C C C C C C C C
charge: -0.221389 -0.212393 -0.067025 -0.211962 -0.051778 -0.078083 0.017899 0.031130 0.054992 -0.006989 -0.001705 0.044684 -0.016620 0.174161 0.022950 0.296113 0.072860 0.050767 0.051509 -0.098589 -0.203724 0.401420 -0.098526 0.026859 0.023440
polarizability: 3.61295680e+02 -1.16088868e+01 2.37209052e+02 6.75176749e+00 2.37081670e+01 1.64965563e+02
1716.lowfreq: -1.9735 -0.0008 -0.0008 -0.0007 2.8947 5.6379 14.0321 23.7672 28.0818
frequency: 14.0205 23.7347 27.9924 29.5423 33.4684 41.6166 64.6269 69.2453 84.7320 88.7916 97.6136 118.4255 124.2992 149.4458 172.1656 174.1309 224.7927 227.5147 239.2706 246.6036 270.9721 280.4826 303.3485 314.2892 329.3748 337.9044 356.7189 371.3712 400.9174 437.5180 451.0149 478.0474 497.7464 539.3350 560.3509 576.6126 594.8027 624.2103 647.3528 680.6233 705.0021 715.9853 741.6103 758.8555 767.6291 773.7626 784.5933 791.5089 817.3040 823.8492 833.5562 845.4973 871.2097 903.5813 914.5668 918.0712 935.3115 954.2615 965.0999 968.7424 1018.4634 1025.2956 1029.6078 1034.4084 1041.9348 1053.0257 1061.6684 1071.3255 1092.8072 1093.6706 1098.6034 1107.0683 1113.7196 1142.1663 1148.7937 1151.7761 1172.7524 1188.1596 1197.0428 1204.0283 1206.2755 1215.7562 1227.0112 1230.9489 1243.7843 1245.1368 1261.7277 1270.5982 1276.0650 1285.7515 1291.0333 1293.9062 1299.4054 1302.3907 1322.6576 1334.5433 1344.9022 1349.3660 1361.3254 1371.7059 1376.8785 1380.8691 1410.3959 1420.4764 1443.8809 1450.2756 1455.2893 1461.3533 1464.1697 1464.4741 1470.0012 1474.5635 1475.0875 1480.5010 1481.0821 1481.7291 1482.6643 1487.3955 1495.5374 1500.0343 1510.6291 1591.3263 1623.0913 2801.7100 2808.2616 2826.1915 2848.4209 2849.8155 2864.2695 2993.9696 2996.0793 3005.6429 3007.8391 3013.8763 3021.3762 3021.6622 3025.5519 3035.1628 3037.7263 3045.2013 3048.6923 3071.5665 3074.5341 3080.5073 3090.6443 3093.9755 3094.4142 3149.2205 3188.6413 3194.7308
redmass: 4.3697 4.8722 3.0370 2.6534 3.8081 5.8854 5.3658 1.9130 2.8704 3.7315 4.8449 2.1204 3.3284 3.7146 4.4568 3.8706 2.4234 2.0466 1.2991 1.3803 2.8404 4.0067 3.4155 2.9982 2.6883 2.4537 3.5958 5.0243 3.5560 2.4790 3.1129 5.7507 3.3911 5.7647 3.8007 5.0479 3.1087 3.3547 5.9140 5.7063 5.7269 5.6628 4.7706 1.1990 3.6851 5.0321 1.5404 1.3583 3.7984 1.5681 2.2760 1.6631 2.0596 2.5926 2.4496 4.1534 1.4763 2.0301 1.5164 1.3195 2.5597 3.6771 1.8734 1.5304 4.2131 2.3163 2.4522 2.1035 1.6798 1.6476 1.5853 1.9717 2.1221 1.5031 2.0221 1.6402 2.0170 1.3835 1.4245 3.5202 2.1774 1.9180 1.5020 7.1325 1.2534 1.4879 2.1107 1.4156 1.2864 1.4569 1.1756 1.2877 1.3175 1.2923 1.4183 1.9029 1.5514 1.9820 4.5215 2.0787 1.4092 1.5276 3.3976 1.1456 1.1641 5.5375 1.1217 1.0630 1.0667 1.0840 1.1129 1.0673 2.1451 1.1714 1.0547 1.2335 1.0977 1.1006 1.1495 1.1034 7.7647 8.2866 8.1705 1.0708 1.0703 1.0718 1.0573 1.0713 1.0569 1.0796 1.0647 1.0623 1.0659 1.0605 1.0756 1.0728 1.0752 1.0721 1.0854 1.0873 1.1004 1.1037 1.1047 1.1011 1.1006 1.0984 1.1054 1.0907 1.0944 1.0934
irintensity: 0.0711 1.1104 0.2138 0.2664 0.7675 0.5434 0.8379 0.2716 0.1377 1.3444 0.7644 0.6121 0.2801 0.7952 0.6509 0.6438 0.4764 4.3490 0.8904 2.0289 1.8199 3.4488 2.2592 5.3618 2.7939 11.5619 2.0944 0.4127 5.4930 0.9103 2.9827 1.0321 8.9860 0.3568 5.7759 0.2741 0.9061 1.8891 3.8502 2.0400 23.0273 29.5365 1.1886 9.3205 0.7963 5.8049 0.8395 1.3020 24.9609 33.7745 8.3902 7.7063 8.2519 6.4066 14.7556 4.1149 26.1378 0.6581 2.2691 1.9376 19.7848 7.0608 6.9079 15.8018 6.3808 39.7658 11.3532 21.1177 5.5715 7.8598 0.9753 11.6832 33.0308 14.4115 38.7627 52.5284 42.7695 3.1739 9.0456 211.4738 49.3482 7.1495 13.0730 283.0801 16.8064 45.7465 3.2038 14.9832 1.1784 4.1371 3.4967 4.1813 9.7238 1.1939 20.4542 13.5485 29.1670 31.9578 105.0763 60.2444 16.9570 11.1520 18.1631 2.7843 3.2607 39.7560 4.6903 8.8622 12.5915 10.1197 9.3602 6.4892 28.1323 8.4851 11.4093 9.1475 0.3120 25.4442 17.5692 4.9371 37.1935 3.4956 86.9748 83.2923 86.7033 107.4373 64.6557 153.2708 202.9559 15.5758 4.3378 47.6457 14.8750 18.0632 61.4268 36.8828 52.7354 39.5212 15.2009 40.8706 1.3375 11.3389 32.7239 35.6990 44.4807 7.7614 66.9946 9.4819 3.4453 6.2625
temp: 298.150 k
press: 1.00000 atm
elementType: 8 8 7 7 7 7 7 6 6 6 6 6 6 6 6 6 6 6 6 6 6 6 6 6 6 1 1 1 1 1 1 1 1 1 1 1 1 1 1 1 1 1 1 1 1 1 1 1 1 1 1 1
symmnumber: 1
zpe: 1142714.9 jmol-1
zpe.correction: 0.435237 hartree
zpe.thermalcorrener: 0.460389 hartree
zpe.thermalcorrenthalpy: 0.461333 hartree
zpe.thermalcorrgfe: 0.375698 hartree
zpe.sumelectzpe: -1124.311597 hartree
zpe.sumelectthermal: -1124.286445 hartree
zpe.sumelectthermalent: -1124.285501 hartree
zpe.sumelectthermalfe: -1124.371137 hartree
dipole: -9.2432 5.1741 3.1098
dipole: 11.0399
quadrupole: -193.4264 -144.2237 -152.1463
quadrupole: 16.6639 -2.3669 -1.8190
quadrupole: -30.1610 19.0418 11.1192 16.6639 -2.3669 -1.8190
hfenergy: -1124.7468341 hartree
pointgroup: C01 [X(C18H27N5O2)]
dipole: -3.6911289 1.9389789 1.217106 debye
polarizability: 361.8682965|-8.0167014|236.9240777|5.8709001|23.4864779|164.6779216 unknown
InChI: InChI=1S/C18H27N5O2/c1-20(2)9-5-12-22-17-7-6-15(23(24)25)14-16(17)19-18(22)8-13-21-10-3-4-11-21/h6-7,14H,3-5,8-13H2,1-2H3
charge 0 multiplicity 1
52 atoms
O  6.572555 -0.219588 0.654565
O  6.06654 -2.036391 -0.627053
N  -3.715195 -2.370397 -0.102175
N  0.230092 0.124194 0.218521
N  0.862165 -1.72807 -0.981455
N  -1.860224 4.657517 -0.423157
N  5.725542 -0.986751 0.046261
C  -4.640124 -1.203219 -0.095585
C  -4.355581 -3.409277 0.746649
C  -6.068271 -1.816537 0.04546
C  -5.831869 -3.338476 0.307007
C  -2.317692 -2.070438 0.234305
C  -1.614679 -1.265655 -0.896359
C  -0.177624 -0.973097 -0.58358
C  -0.620026 1.193492 0.770656
C  1.622002 0.061949 0.317318
C  -0.713946 2.428336 -0.155995
C  2.004892 -1.106904 -0.432755
C  -1.531135 3.55611 0.508989
C  2.566369 0.882144 0.973382
C  3.359307 -1.471026 -0.534846
C  4.289784 -0.641721 0.127156
C  3.918499 0.515577 0.871843
C  -2.874053 5.570918 0.145972
C  -0.670993 5.391573 -0.904044
H  -4.423455 -0.524889 0.771361
H  -4.526968 -0.60888 -1.019959
H  -3.892224 -4.395393 0.566451
H  -4.262685 -3.177126 1.839402
H  -6.606922 -1.346233 0.886857
H  -6.672483 -1.658039 -0.863426
H  -5.965127 -3.911736 -0.626396
H  -6.516856 -3.751197 1.067581
H  -2.236362 -1.506538 1.204267
H  -1.771927 -3.022335 0.36703
H  -2.169089 -0.328519 -1.091938
H  -1.648926 -1.870184 -1.817005
H  -1.626463 0.777632 0.955174
H  -0.208223 1.484811 1.755969
H  0.308514 2.771815 -0.399213
H  -1.203515 2.151503 -1.108451
H  -2.490217 3.134825 0.872457
H  -0.978305 3.927263 1.415503
H  2.273197 1.770433 1.541562
H  3.687986 -2.348884 -1.094987
H  4.706291 1.100239 1.352761
H  -2.523559 6.110074 1.062924
H  -3.153762 6.328367 -0.607378
H  -3.783021 5.001264 0.41016
H  0.003901 4.716322 -1.45608
H  -0.086744 5.871319 -0.076899
H  -0.990091 6.185326 -1.601907
