program: Gaussian 09
title: 000028728
version: EM64L-G09RevD.01
frameworkgroup: C1[X(C9H5Cl3N4O2S)]
method: RPBEPBE
basis: SDD
operation: Freq
keyword: #p
keyword: freq=noraman
keyword: PBEPBE/SDD
title: #p freq=noraman PBEPBE/SDD
converged: NO YES NO NO
title: Mulliken charges:
elementType: Cl Cl Cl S O O N N N N C C C C C C C C C H H H H H
charge: -0.012179 0.054418 0.036195 1.008054 -0.513458 -0.460488 -0.600340 -0.010988 0.023258 0.118819 -0.051194 -0.234531 -0.161678 0.213611 -0.178519 -0.197221 -0.105784 -0.244931 -0.216653 0.379827 0.297242 0.305823 0.274399 0.276319
chargesum: 0.00000
title: Mulliken charges with hydrogens summed into heavy atoms:
elementType: Cl Cl Cl S O O N N N N C C C C C C C C C
charge: -0.012179 0.054418 0.036195 1.008054 -0.513458 -0.460488 -0.220513 -0.010988 0.023258 0.118819 -0.051194 0.062711 0.144145 0.213611 0.095880 0.079097 -0.105784 -0.244931 -0.216653
polarizability: 2.45124896e+02 -1.16182328e+01 1.97992458e+02 1.43570678e+00 -1.96569499e+01 1.35130295e+02
1716.lowfreq: -12.1748 -8.6447 -5.1865 -0.0027 -0.0022 -0.0020 15.0565 20.2860 47.8573
frequency: 14.7531 20.1486 47.8413 64.5866 70.0360 118.7108 124.3203 143.3668 162.3586 173.8045 182.5302 209.5995 224.9337 231.5007 261.5280 287.5370 356.6836 375.6326 384.2794 388.9111 408.5446 427.3082 434.6607 490.8587 504.6489 574.7064 607.5490 610.1071 620.4326 665.7118 670.4467 695.6677 703.5870 793.2054 798.5815 822.5635 825.5371 834.5774 878.5379 948.0962 955.9372 969.2969 974.7700 977.9508 1041.7254 1067.5664 1109.6546 1128.7232 1177.7634 1189.2568 1244.9809 1276.8599 1286.1560 1382.2155 1383.9744 1416.0856 1448.1312 1451.2583 1503.3198 1564.5178 1592.6016 3161.8102 3174.4945 3182.9048 3191.2355 3510.5236
redmass: 11.4445 21.9717 5.0538 11.5269 12.4919 11.0396 11.1335 14.7820 15.4316 16.7883 13.7127 14.0926 16.7357 9.6086 9.3179 8.6869 7.0547 10.2935 16.2293 13.7670 2.9307 11.9904 13.3180 8.1305 3.8604 1.3501 7.8938 7.6952 11.0545 3.7628 9.7213 4.5379 5.8766 12.6748 10.9306 1.8366 2.9086 1.4833 13.2738 6.7272 1.3567 1.6068 6.4202 6.8276 2.6186 3.3136 1.3596 3.8977 1.2822 5.4403 3.5417 2.9525 1.2425 3.7403 6.0082 6.0788 2.6435 5.3149 10.8106 6.0402 8.1330 1.0900 1.0897 1.0969 1.0978 1.0786
irintensity: 0.3125 0.0806 0.0635 0.5774 1.6474 3.0591 3.5170 0.3990 1.5734 0.8426 2.4437 5.7992 4.9608 2.4083 1.2551 15.9159 9.2573 21.7934 3.5124 66.9490 0.6567 46.8071 50.9944 19.6491 143.0211 74.9282 15.5495 18.4207 1.3113 108.9997 2.9940 8.3195 56.0293 11.0573 199.5964 67.4094 89.3747 49.0069 0.9302 126.5914 1.4087 11.0538 50.3390 22.2168 39.4144 65.3078 4.5121 59.8709 61.0378 167.4273 10.9051 283.1594 7.0486 20.0787 1.7427 409.6753 138.0409 167.6848 1167.8539 48.3518 4.6670 3.5112 1.9160 0.8432 5.5705 114.5198
temp: 298.150 k
press: 1.00000 atm
elementType: 17 17 17 16 8 8 7 7 7 7 6 6 6 6 6 6 6 6 6 1 1 1 1 1
symmnumber: 1
zpe: 356021.2 jmol-1
zpe.correction: 0.135601 hartree
zpe.thermalcorrener: 0.153653 hartree
zpe.thermalcorrenthalpy: 0.154597 hartree
zpe.thermalcorrgfe: 0.085971 hartree
zpe.sumelectzpe: -2492.104063 hartree
zpe.sumelectthermal: -2492.086012 hartree
zpe.sumelectthermalent: -2492.085067 hartree
zpe.sumelectthermalfe: -2492.153693 hartree
dipole: 3.0842 -0.6706 -2.1981
dipole: 3.8463
quadrupole: -141.2315 -148.9343 -139.4886
quadrupole: -5.7380 -3.7392 -8.8742
quadrupole: 1.9867 -5.7162 3.7295 -5.7380 -3.7392 -8.8742
hfenergy: -2492.2396647 hartree
pointgroup: C01 [X(C9H5Cl3N4O2S1)]
dipole: 1.3299491 -0.6799729 -0.2423906 debye
dipolederiv: -0.4538823 0.3439596 -0.1516635 0.435851 -0.4303834 0.1990637 -0.171172 0.1772129 -0.1594835 -0.65821 -0.2010459 -0.4104514 -0.2351902 -0.128369 -0.1402519 -0.4691904 -0.1372714 -0.3996596 -0.1087766 0.0088268 -0.0724507 -0.0558927 -0.1755222 0.2581635 0.0548402 0.2934416 -0.7395355 2.6324231 0.3190279 0.3095471 0.2136919 1.9115035 -0.0238654 0.8675466 0.2553649 1.312731 -0.7334952 -0.0647127 -0.0538222 -0.010085 -0.6374433 0.0569625 0.0239767 0.1941951 -0.5446459 -0.6676701 0.0957299 0.0136418 0.0158735 -0.6171299 -0.0115335 -0.173776 -0.1555504 -0.5065172 -1.8230668 -0.6873792 0.0211735 -0.7652648 -1.0907734 -0.0028797 0.1773935 0.1387785 -0.5085642 -0.8361552 -0.4025333 0.1025393 -0.6404312 -0.6245078 0.3877132 0.4749729 0.5578587 -0.7759671 -1.5973471 -0.7488729 -0.3025595 -0.9594406 -0.7050542 -0.0477024 -0.2688284 0.0297223 -0.5202541 -0.8139911 -0.1772467 -0.5624828 -0.3159421 -0.3283111 0.1417512 -0.5305787 0.2186332 -1.3577617 -0.1508314 -0.0439765 -0.0017903 -0.0307546 -0.2572498 0.0225645 0.0114281 -0.0711733 -0.1001384 0.0580186 -0.1482297 0.0896919 0.0654034 -0.047468 -0.0867461 -0.2667365 0.1224082 -0.0916973 -0.0794732 0.08248 -0.1154412 -0.075344 -0.0173835 0.0340357 0.1877682 -0.1560021 -0.0071547 1.7804873 0.8281221 0.1134981 1.2442379 1.011079 -0.1092146 -0.682837 -0.6188602 0.5684636 -0.1337067 0.1195663 -0.1683633 0.1341622 -0.2477245 0.1590865 -0.137019 0.1172726 -0.1378792 -0.3185164 0.1578735 -0.0376954 0.233494 -0.1951257 -0.0403567 -0.0785888 0.0124915 -0.0088736 0.6806413 -0.6029215 0.1937976 -0.7155377 0.6552979 -0.3657774 0.2289264 -0.3369697 0.2575022 1.6261742 0.6825816 0.6684241 0.8393761 0.6529348 -0.0709692 0.7106853 -0.1192052 1.3807666 1.0443397 0.3977056 0.3067426 0.6886024 0.6314579 -0.4823701 -0.0153906 -0.6085607 1.6847297 0.1166408 -0.1001667 -0.0822275 -0.1883776 0.2089726 -0.0386795 -0.090272 -0.0542332 0.286101 0.1726924 0.0274306 -0.0016858 -0.0205485 0.1136293 0.0571343 0.0154422 0.0312789 0.0892308 0.1334116 0.0303034 0.0558632 0.0261888 0.116233 0.0106381 0.0633619 0.0275404 0.1409518 0.033691 0.0556853 0.056756 0.0768977 0.1095432 0.0182336 0.0462165 0.0211626 0.088624 0.0966018 0.0277924 0.0289586 0.0390303 0.0917947 0.0749995 0.0218311 0.0604648 0.0490314 unknown
polarizability: 235.7666931|1.3418209|162.728602|25.850335|-37.9261413|179.7523532 unknown
InChI: InChI=1S/C9H5Cl3N4O2S/c10-5-1-3-6(4-2-5)19(17,18)16-9-14-7(11)13-8(12)15-9/h1-4,16H
charge 0 multiplicity 1
24 atoms
Cl 4.630929 -2.482951 1.609901
Cl -4.897066 -1.305423 -2.454537
Cl -2.400296 -1.605541 2.295808
S  0.614857 2.119573 -0.411954
O  1.368281 2.987954 -1.553483
O  -0.122383 2.809357 0.843401
N  -0.668783 1.236682 -1.489649
N  -1.514696 -0.092351 0.264891
N  -2.653906 0.057654 -1.889247
N  -3.544013 -1.351757 -0.129995
C  1.748691 0.7395 0.170563
C  2.870743 0.461183 -0.627459
C  1.459497 0.102112 1.387653
C  -1.6334 0.392602 -1.021223
C  3.760638 -0.538387 -0.177717
C  2.356927 -0.894083 1.829616
C  3.485575 -1.198687 1.038883
C  -3.54602 -0.810455 -1.378609
C  -2.49511 -0.939465 0.623687
H  -0.772977 1.65909 -2.420785
H  3.055367 1.015014 -1.553085
H  0.565565 0.360865 1.960457
H  4.65003 -0.792974 -0.759955
H  2.176549 -1.422413 2.769237
