program: Gaussian 09
title: 000028659
version: EM64L-G09RevD.01
frameworkgroup: C1[X(C4H7ClO2)]
method: RPBEPBE
basis: SDD
operation: Freq
keyword: #p
keyword: freq=noraman
keyword: PBEPBE/SDD
title: #p freq=noraman PBEPBE/SDD
converged: YES YES NO NO
title: Mulliken charges:
elementType: Cl O O C C C C H H H H H H H
charge: -0.048160 -0.254522 -0.221178 -0.439422 -0.627408 0.340318 -0.502347 0.298463 0.219640 0.242165 0.260894 0.243967 0.238723 0.248867
chargesum: 0.00000
title: Mulliken charges with hydrogens summed into heavy atoms:
elementType: Cl O O C C C C
charge: -0.048160 -0.254522 -0.221178 -0.140959 0.095290 0.340318 0.229210
polarizability: 6.84309141e+01 1.11546193e+00 5.94863445e+01 -2.29342563e+00 -4.49123599e-01 4.80875053e+01
1716.lowfreq: -6.1750 -2.3326 0.0019 0.0032 0.0036 9.3151 43.5444 86.3048 122.8504
frequency: 43.4559 86.2377 122.8466 196.9697 227.7963 243.9125 282.0845 311.4189 436.7346 570.0716 643.4261 719.8142 804.6449 930.0298 992.6059 1067.3634 1108.0291 1114.0069 1136.2015 1152.0000 1220.6060 1330.0438 1398.4079 1423.1064 1453.1495 1460.4965 1462.1427 1465.0696 1647.2655 2994.7851 3007.5422 3090.1824 3107.5275 3110.7789 3130.3224 3155.6340
redmass: 4.5756 1.1150 4.5313 3.0777 3.2443 1.2819 3.2336 4.6782 4.6324 5.3143 4.2949 6.3748 3.8305 5.9537 1.5555 1.4871 3.4337 1.3203 2.1974 1.5195 1.2590 1.7592 1.2237 1.1847 1.0496 1.0418 1.0494 1.0532 9.2193 1.0391 1.0295 1.0942 1.0908 1.1047 1.0995 1.1049
irintensity: 2.5112 0.4569 1.9710 4.0207 6.9136 1.7613 3.0322 16.2456 9.3266 25.7228 12.5931 1.5404 12.1743 8.9000 24.4038 32.6524 85.5955 4.0507 131.4696 42.5809 21.7085 33.1642 23.9318 13.8520 17.2769 11.6401 15.1949 13.2248 166.9668 10.9958 25.2798 10.4851 5.0290 23.6881 11.2019 14.0768
temp: 298.150 k
press: 1.00000 atm
elementType: 17 8 8 6 6 6 6 1 1 1 1 1 1 1
symmnumber: 1
zpe: 279009.3 jmol-1
zpe.correction: 0.106269 hartree
zpe.thermalcorrener: 0.114873 hartree
zpe.thermalcorrenthalpy: 0.115817 hartree
zpe.thermalcorrgfe: 0.071939 hartree
zpe.sumelectzpe: -766.564645 hartree
zpe.sumelectthermal: -766.556041 hartree
zpe.sumelectthermalent: -766.555097 hartree
zpe.sumelectthermalfe: -766.598975 hartree
dipole: 1.5367 0.6988 -1.9847
dipole: 2.6055
quadrupole: -41.0408 -49.8547 -50.6794
quadrupole: -5.1190 0.4469 -3.5656
quadrupole: 6.1508 -2.6630 -3.4877 -5.1190 0.4469 -3.5656
hfenergy: -766.670914 hartree
pointgroup: C01 [X(C4H7Cl1O2)]
dipole: 0.6618689 0.757025 -0.1990484 debye
dipolederiv: -0.3317991 -0.0875833 -0.109983 -0.0880539 -0.4107655 -0.1777261 -0.087649 -0.1405751 -0.2777795 -1.2497695 0.0883994 0.3202339 0.097719 -0.3109365 0.0436982 0.4185199 0.035186 -0.6485085 -0.596586 0.080977 -0.1142824 0.0126378 -0.326798 0.210323 0.2116504 0.0644016 -0.8672977 0.1615668 0.1137799 0.0153598 0.155185 0.6066258 0.2485184 0.0217314 0.2351737 0.2776352 -0.0783627 0.0120268 0.0320702 0.0351979 -0.081366 -0.0941566 0.0167475 -0.0691668 -0.0818816 1.3676373 -0.0826439 -0.1591727 -0.039852 0.1307542 -0.2928051 -0.5378109 -0.1386943 1.2099496 0.602485 -0.0499688 -0.0522732 -0.0945406 0.2886758 0.0380076 0.0309053 0.0147609 0.2198631 0.0337579 -0.0553809 0.0233978 -0.0342169 -0.0227221 0.0200284 0.0071513 0.0202902 -0.0253813 0.0613168 -0.0747922 -0.0011715 -0.082713 -0.0556716 -0.0765829 -0.0127442 -0.093414 0.0625016 -0.0764216 0.0794418 -0.0532729 0.0499926 0.1034598 0.0157402 -0.0759483 0.0168148 0.0597053 0.1261131 0.0098682 0.0191191 -0.0334824 0.0385911 0.1017695 0.0414704 0.0628691 0.0076888 -0.0093383 0.006643 -0.0114691 -0.0108951 0.0233704 -0.0934141 -0.1158306 -0.0861367 -0.0138306 -0.0096719 0.0040422 0.0772583 -0.0073063 0.1140705 0.0338724 0.1212185 0.0241583 -0.0232931 -0.0009278 -0.0448091 0.0141856 0.0403279 -0.0972879 0.0227271 -0.0394115 0.0543324 0.1006289 unknown
polarizability: 68.5517447|1.2246586|52.604315|1.0504599|5.7919068|54.8487041 unknown
InChI: InChI=1S/C4H7ClO2/c1-3(5)4(6)7-2/h3H,1-2H3
charge 0 multiplicity 1
14 atoms
Cl -1.717018 -0.790143 -1.108236
O  1.476121 0.28465 -0.719019
O  0.632001 -0.193023 1.403034
C  -0.84411 0.739711 -0.352599
C  -1.760358 1.375865 0.684263
C  0.465879 0.222175 0.235861
C  2.794998 -0.250129 -0.295281
H  -0.646762 1.376715 -1.226122
H  -1.292282 2.29823 1.078559
H  -2.730154 1.640673 0.23321
H  -1.92379 0.688185 1.529275
H  3.168552 0.307689 0.579657
H  3.447356 -0.109104 -1.167592
H  2.701366 -1.317494 -0.034711
