program: Gaussian 09
title: 000028649
version: EM64L-G09RevD.01
frameworkgroup: C1[X(C14H12O)]
method: RPBEPBE
basis: SDD
operation: Freq
keyword: #pfreq=noraman
keyword: PBEPBE/SDD
title: #p freq=noraman PBEPBE/SDD
converged: YES YES NO NO
title: Mulliken charges:
elementType: O C C C C C C C C C C C C C C H H H H H H H H H H H H
charge: -0.301842 -0.274142 -0.273341 0.481971 0.479913 -0.370128 -0.370090 -0.406041 -0.405766 -0.233281 -0.233141 -0.229835 -0.229820 -0.238010 -0.237978 0.240986 0.240958 0.262214 0.262500 0.232791 0.232835 0.227277 0.227275 0.227431 0.227407 0.229946 0.229911
chargesum: 0.00000
title: Mulliken charges with hydrogens summed into heavy atoms:
elementType: O C C C C C C C C C C C C C C
charge: -0.301842 -0.033156 -0.032384 0.481971 0.479913 -0.107914 -0.107591 -0.173249 -0.172931 -0.006004 -0.005867 -0.002404 -0.002413 -0.008064 -0.008067
polarizability: 2.29818540e+02 1.63998284e-01 1.06721772e+02 1.12613235e+01 1.35630753e-01 1.19045332e+02
1716.lowfreq: -10.9362 0.0005 0.0006 0.0007 3.6937 5.1908 34.5624 49.5707 53.7784
frequency: 34.4393 49.5225 53.7758 86.8148 155.5950 194.0367 227.3958 329.9794 358.1154 403.0861 403.4014 406.0261 497.7027 515.1800 594.6343 614.0569 614.7952 615.2545 703.0897 703.3682 741.6341 744.3772 774.7775 800.5555 829.2846 841.9198 855.1365 855.6037 921.5122 926.6719 977.3670 977.6433 988.4972 988.6613 996.4647 996.6163 1024.1269 1026.0751 1060.7979 1066.1300 1083.3784 1083.7219 1155.0355 1172.7411 1172.9113 1183.7602 1185.2552 1228.7634 1241.2200 1291.6070 1318.1995 1337.0940 1377.0481 1389.1160 1396.3540 1440.8950 1447.2622 1485.8478 1486.2888 1592.1318 1592.4891 1615.2147 1616.2101 3076.6108 3084.7407 3117.8507 3117.9008 3127.7078 3127.7744 3139.3573 3139.4223 3150.4296 3150.4937 3164.9360 3165.1195
redmass: 3.6796 4.7506 5.1079 4.2749 4.8874 4.6461 4.8270 3.9319 5.1350 3.0161 2.8704 6.7441 3.5000 3.2125 5.9321 6.4168 6.2286 5.4874 2.0320 1.8919 3.5363 1.8998 2.3170 4.5308 4.8662 3.3102 1.2648 1.2528 1.3916 1.5052 1.3884 1.3862 6.0430 5.9543 1.3172 1.3142 2.2433 2.1206 1.2744 1.3969 1.4750 1.5226 3.6079 1.0554 1.0559 1.1119 1.1149 2.0092 1.4757 1.6294 1.4519 1.2994 4.1476 6.2173 3.0076 2.1743 2.1914 2.4099 2.4806 6.0711 6.0975 6.0143 6.0730 1.0907 1.0879 1.0870 1.0870 1.0865 1.0865 1.0914 1.0915 1.0960 1.0960 1.1015 1.1015
irintensity: 0.0086 0.6654 0.4710 1.3925 0.0037 7.7124 0.2384 2.1914 0.2134 1.0823 0.0925 1.6181 6.3981 14.2896 36.2219 0.4316 0.3007 0.6852 35.8995 44.1154 7.1639 108.7179 48.2525 10.9447 6.7106 0.0032 0.2007 0.1096 2.5345 0.4604 0.1389 0.0556 0.0125 0.1130 0.2212 0.1153 1.4009 14.0829 0.1701 4.9586 12.5357 12.8044 0.0814 0.4119 0.0161 2.3083 0.0559 2.3347 0.3585 11.8958 0.0178 0.2425 1.1500 0.0425 1.5525 11.5998 14.2338 30.6561 2.5199 1.0918 0.4701 0.0515 15.8240 1.4734 32.8686 5.0805 11.5747 0.1844 0.2715 20.4938 11.1358 26.7771 31.9396 50.4216 1.8935
temp: 298.150 k
press: 1.00000 atm
elementType: 8 6 6 6 6 6 6 6 6 6 6 6 6 6 6 1 1 1 1 1 1 1 1 1 1 1 1
symmnumber: 1
zpe: 564691.3 jmol-1
zpe.correction: 0.215080 hartree
zpe.thermalcorrener: 0.227203 hartree
zpe.thermalcorrenthalpy: 0.228147 hartree
zpe.thermalcorrgfe: 0.175018 hartree
zpe.sumelectzpe: -614.831218 hartree
zpe.sumelectthermal: -614.819095 hartree
zpe.sumelectthermalent: -614.818151 hartree
zpe.sumelectthermalfe: -614.871280 hartree
dipole: -0.0042 -2.2064 0.0171
dipole: 2.2064
quadrupole: -74.1752 -92.0534 -81.3128
quadrupole: 0.0335 2.8843 0.0904
quadrupole: 8.3386 -9.5396 1.2010 0.0335 2.8843 0.0904
hfenergy: -615.0462979 hartree
pointgroup: C01 [X(C14H12O1)]
dipole: -0.001133 0.8680668 0.0030743 debye
polarizability: 230.2187014|-0.1186431|106.7203834|-9.0744046|0.0015498|118.6465593 unknown
InChI: InChI=1S/C14H12O/c1-3-7-11(8-4-1)13-14(15-13)12-9-5-2-6-10-12/h1-10,13-14H
charge 0 multiplicity 1
27 atoms
O  -0.000271 -1.753384 -0.006372
C  -0.50952 -0.443782 -0.564298
C  0.510094 -0.449252 0.561455
C  -1.94843 -0.116289 -0.338991
C  1.949462 -0.121078 0.337884
C  -2.681787 -0.73028 0.70905
C  2.683981 -0.735009 -0.709257
C  -2.593374 0.830781 -1.175252
C  2.59294 0.826389 1.174747
C  -4.034933 -0.391983 0.922246
C  4.037307 -0.396255 -0.921023
C  -3.946211 1.172735 -0.957052
C  3.945923 1.168741 0.957967
C  -4.670627 0.563711 0.093953
C  4.671717 0.559737 -0.092136
H  -0.112133 -0.216266 -1.564162
H  0.113651 -0.228753 1.563311
H  -2.190432 -1.494185 1.322354
H  2.193114 -1.498779 -1.32307
H  -2.035762 1.300645 -1.995236
H  2.034251 1.296204 1.99401
H  -4.597743 -0.876945 1.727789
H  4.601199 -0.881125 -1.725868
H  -4.435331 1.906448 -1.607525
H  4.434121 1.902763 1.60879
H  -5.721942 0.823971 0.259992
H  5.723136 0.820337 -0.257006
