program: Gaussian 09
title: 000028761
version: EM64L-G09RevD.01
frameworkgroup: C1[X(C19H23N3O4)]
method: RPBEPBE
basis: SDD
operation: Freq
keyword: #p
keyword: freq=noraman
keyword: PBEPBE/SDD
title: #p freq=noraman PBEPBE/SDD
converged: YES YES NO NO
title: Mulliken charges:
elementType: O O O O N N N C C C C C C C C C C C C C C C C C C C H H H H H H H H H H H H H H H H H H H H H H H
charge: -0.274045 -0.288538 -0.300816 -0.312691 -0.141915 -0.150021 -0.105456 -0.390817 -0.376711 -0.385955 -0.370809 0.132612 0.252805 0.361283 -0.319150 -0.579013 -0.504083 0.242000 0.289434 -0.179495 0.042180 -0.345564 -0.217619 -0.522998 -0.526948 -0.524997 0.261492 0.228315 0.217739 0.251356 0.280291 0.225093 0.220595 0.208013 0.213359 0.289271 0.276559 0.229941 0.233787 0.228920 0.264153 0.210491 0.230921 0.232577 0.221059 0.251696 0.258702 0.227614 0.235384
chargesum: 0.00000
title: Mulliken charges with hydrogens summed into heavy atoms:
elementType: O O O O N N N C C C C C C C C C C C C C C C C C C C
charge: -0.274045 -0.288538 -0.300816 -0.312691 -0.141915 -0.150021 -0.105456 0.098989 0.092383 0.119428 0.057799 0.132612 0.252805 0.361283 -0.105791 -0.289742 -0.227524 0.242000 0.289434 0.050446 0.042180 -0.111777 0.011301 0.182568 0.178383 0.196703
polarizability: 3.77335104e+02 -6.17696239e+00 2.23743593e+02 1.63132519e+01 5.44122224e+00 1.72127005e+02
1716.lowfreq: -10.0511 -6.1669 -2.4961 -0.0001 0.0007 0.0009 10.2532 25.0556 30.7095
frequency: 10.0931 25.0409 30.6997 39.3220 57.3385 62.0421 68.9493 74.5187 77.9703 91.7022 107.1018 130.1442 142.8910 150.5594 158.0147 162.9552 181.8577 208.6209 229.2253 240.1697 244.4705 282.8535 288.5264 302.4662 311.4795 326.5503 369.1510 394.3619 402.3275 409.3610 430.5995 451.9196 466.5732 495.5235 508.6552 512.9990 527.8704 574.8320 596.5601 617.7688 619.6079 627.7429 651.3561 692.0726 726.9731 727.7125 736.5523 767.9536 771.4608 801.1766 836.4468 847.2838 867.4118 888.3507 901.1215 904.7182 931.3856 936.5548 944.0833 950.6504 954.7729 977.1661 980.9345 1024.9751 1035.6878 1037.9979 1044.1019 1047.3368 1080.6839 1093.1104 1110.7142 1111.1704 1112.6566 1118.1951 1149.1412 1152.2947 1157.8585 1159.2704 1171.4857 1175.9763 1201.2204 1211.2126 1213.0746 1227.2124 1254.3477 1276.4031 1297.0491 1302.0763 1329.0692 1338.1408 1346.7333 1354.7929 1357.4401 1365.6602 1389.1965 1391.8900 1404.8601 1420.1511 1424.8921 1433.1674 1435.8769 1448.6071 1452.5138 1456.9854 1458.3050 1459.3207 1460.5167 1465.3847 1467.3770 1476.3357 1483.4820 1485.1266 1486.0759 1548.0297 1552.4690 1569.2229 1597.3511 1601.2987 2936.8208 2957.8401 2972.9774 2974.5124 2980.7172 2981.2954 2993.9758 3071.4274 3082.2712 3083.4538 3090.0447 3096.8590 3097.5230 3099.1104 3120.5456 3122.9085 3123.8976 3129.2049 3135.4225 3159.2666 3163.5425 3175.4010 3177.1377
redmass: 5.1172 5.0850 4.0091 4.8190 4.6340 3.3058 2.5126 3.5877 2.6859 2.8610 2.8322 2.4862 1.8114 3.6146 1.2095 1.2718 4.3249 3.2981 4.8868 4.0916 3.7034 5.3929 2.8492 3.0814 6.2030 3.9876 5.4331 5.2977 2.1213 3.4297 6.2306 2.7350 4.0908 5.3142 2.8817 5.7300 5.1624 5.8879 4.0588 6.2345 5.1409 2.7640 4.4433 5.6710 3.5006 1.9360 5.2198 2.4987 4.5126 5.2852 1.5875 1.3758 6.5185 3.7125 1.4621 1.8398 4.2405 8.6374 1.4148 4.9924 2.7906 1.3548 3.8964 2.9043 4.7927 3.1158 2.0474 1.8319 2.0870 1.7246 1.2397 1.2578 1.2468 2.5546 1.4285 1.4152 1.4735 2.8431 1.1342 2.4715 2.0498 1.4582 1.3213 1.9254 1.5354 1.4539 3.8783 1.9404 1.7103 1.7303 1.4440 4.5656 1.5441 1.3742 2.6751 2.0824 2.0296 1.3980 2.1437 1.3186 1.3340 1.1366 1.2195 1.1611 1.0641 1.1341 1.0875 1.7625 1.2365 1.0584 1.0566 2.1846 1.1312 8.2592 5.2461 8.2606 6.0679 6.8533 1.0708 1.0695 1.0317 1.0344 1.0302 1.0665 1.0657 1.1031 1.1048 1.0981 1.0907 1.0974 1.0931 1.0952 1.0894 1.1028 1.1036 1.1047 1.0884 1.0916 1.0926 1.0925 1.1002
irintensity: 0.0322 1.1105 0.5626 0.1491 2.0048 2.0729 1.2590 1.3476 6.1530 8.1702 1.8778 0.5477 5.0330 5.9942 1.3155 0.3302 0.5258 4.0827 0.7469 4.4837 18.0866 8.6024 13.7643 6.8672 1.6848 3.5690 2.7092 21.7269 4.4999 3.3484 1.4134 1.4794 3.7024 7.1883 8.3795 1.6863 1.6580 1.7508 9.4203 1.4557 23.9523 0.6646 9.5178 4.7369 10.3109 23.6181 32.6265 61.2862 6.5153 19.1867 0.0703 0.2382 8.8449 12.0007 8.4442 29.3195 29.0419 87.1056 1.4835 60.1076 9.4936 7.3077 178.8573 28.4180 127.5513 40.6279 8.6312 3.8610 5.6522 7.1046 10.9192 9.8536 5.2195 12.8878 13.0092 12.0432 16.2811 18.5810 18.7126 89.8732 18.6700 15.1375 26.9831 165.7223 77.7438 37.2165 365.2196 22.6225 11.5682 23.0885 8.7644 11.9042 4.1545 20.2940 43.5004 16.2912 250.4473 91.9285 26.9005 16.1235 32.3829 42.7241 0.6645 17.8353 24.5826 16.8190 2.8816 20.9133 62.7571 3.4093 27.4054 239.5554 15.6467 320.8190 37.4550 48.0373 394.2654 8.5812 53.0678 42.4892 58.4965 98.7074 66.6355 34.8854 60.5188 27.1298 16.5852 37.9361 19.3571 4.5243 10.4838 11.9697 32.8284 22.5911 23.5569 13.6084 10.9968 2.1853 34.2182 1.1962 16.3618
temp: 298.150 k
press: 1.00000 atm
elementType: 8 8 8 8 7 7 7 6 6 6 6 6 6 6 6 6 6 6 6 6 6 6 6 6 6 6 1 1 1 1 1 1 1 1 1 1 1 1 1 1 1 1 1 1 1 1 1 1 1
symmnumber: 1
zpe: 1033329.7 jmol-1
zpe.correction: 0.393574 hartree
zpe.thermalcorrener: 0.419274 hartree
zpe.thermalcorrenthalpy: 0.420218 hartree
zpe.thermalcorrgfe: 0.334688 hartree
zpe.sumelectzpe: -1200.985825 hartree
zpe.sumelectthermal: -1200.960125 hartree
zpe.sumelectthermalent: -1200.959181 hartree
zpe.sumelectthermalfe: -1201.044711 hartree
dipole: 1.6703 5.2823 3.3847
dipole: 6.4922
quadrupole: -130.7689 -158.6085 -150.6678
quadrupole: 0.5153 4.8113 -0.0918
quadrupole: 15.9128 -11.9267 -3.9861 0.5153 4.8113 -0.0918
hfenergy: -1201.3793991 hartree
pointgroup: C01 [X(C19H23N3O4)]
dipole: 0.5535052 -1.5219001 1.9752498 debye
polarizability: 371.5656087|-36.3139721|178.3352729|-11.6539466|-7.0674509|223.3048196 unknown
InChI: InChI=1S/C19H23N3O4/c1-24-15-12-14(13-16(25-2)18(15)26-3)19(23)22-10-8-21(9-11-22)17-6-4-5-7-20-17/h4-7,12-13H,8-11H2,1-3H3
charge 0 multiplicity 1
49 atoms
O  0.386264 1.260614 -2.622708
O  3.699075 0.907409 2.26157
O  4.368975 -1.897285 -1.775123
O  5.352783 -0.956729 0.769783
N  -0.791255 1.10252 -0.618369
N  -3.459361 0.163973 -0.118302
N  -5.712662 0.805927 -0.332612
C  -1.952904 1.810117 -1.208466
C  -1.10383 0.411429 0.647393
C  -3.147601 0.853826 -1.389626
C  -2.31666 -0.543814 0.472024
C  0.356451 0.921504 -1.394554
C  -4.773504 0.063027 0.346437
C  1.593484 0.354258 -0.740294
C  -5.148569 -0.751858 1.465685
C  2.377627 -0.554512 -1.489945
C  2.043988 0.783552 0.531362
C  3.281917 0.335572 1.047153
C  3.596381 -1.029334 -0.971145
C  -6.492649 -0.762566 1.877558
C  4.083812 -0.560637 0.28472
C  -7.005443 0.771293 0.085991
C  -7.457018 0.013554 1.187365
C  4.191262 -0.005487 3.317201
C  4.656032 -3.223654 -1.181044
C  6.488014 -0.399973 -0.012781
H  -1.636864 2.215564 -2.182809
H  -2.239415 2.640718 -0.534144
H  -1.349895 1.16122 1.426104
H  -0.232817 -0.171991 0.980956
H  -4.049714 1.401799 -1.700972
H  -2.895646 0.104072 -2.169398
H  -2.012692 -1.39528 -0.176179
H  -2.576431 -0.947011 1.463025
H  -4.422182 -1.374077 1.994488
H  2.056517 -0.874097 -2.484933
H  1.48219 1.512647 1.123309
H  -6.7887 -1.383216 2.730816
H  -7.703274 1.383742 -0.498022
H  -8.509577 0.023356 1.482699
H  5.067541 -0.575534 2.969281
H  3.385086 -0.699176 3.625829
H  4.458612 0.653193 4.157345
H  5.285942 -3.741659 -1.919949
H  3.713273 -3.783947 -1.033196
H  5.189826 -3.120349 -0.219647
H  6.418272 -0.716116 -1.068567
H  7.395711 -0.810265 0.455347
H  6.487826 0.702979 0.057143
