program: Gaussian 09
title: 000028690
version: EM64L-G09RevD.01
frameworkgroup: C1[X(C23H26F3N3S)]
method: RPBEPBE
basis: SDD
operation: Freq
keyword: #p
keyword: freq=noraman
keyword: PBEPBE/SDD
title: #p freq=noraman PBEPBE/SDD
converged: YES YES NO NO
title: Mulliken charges:
elementType: S F F F N N N C C C C C C C C C C C C C C C C C C C C C C C H H H H H H H H H H H H H H H H H H H H H H H H H H
charge: 0.238859 -0.164570 -0.170654 -0.169184 -0.084984 -0.102428 -0.291009 -0.099099 -0.513262 -0.513666 -0.360618 -0.360757 -0.379616 -0.371904 -0.327855 -0.440519 -0.411174 0.537889 0.501483 -0.381952 -0.353406 -0.455537 -0.328231 0.324313 -0.253789 -0.265884 -0.392325 -0.239613 -0.253065 0.235984 0.227352 0.231695 0.237615 0.237018 0.231601 0.186541 0.212480 0.213268 0.177246 0.215428 0.188906 0.191852 0.197083 0.221903 0.190977 0.245723 0.211240 0.254220 0.214491 0.280035 0.243451 0.255690 0.248718 0.267667 0.230021 0.234351
chargesum: 0.00000
title: Mulliken charges with hydrogens summed into heavy atoms:
elementType: S F F F N N N C C C C C C C C C C C C C C C C C C C C C C C
charge: 0.238859 -0.164570 -0.170654 -0.169184 -0.084984 -0.102428 -0.291009 0.128253 -0.043953 -0.045047 0.038403 0.029756 0.024718 0.017031 0.085026 0.016444 0.057537 0.537889 0.501483 -0.381952 -0.353406 -0.175502 -0.084780 0.324313 0.001902 -0.017166 -0.124658 -0.009592 -0.018713 0.235984
polarizability: 3.53216646e+02 -5.22796130e+01 2.88949698e+02 -4.34646755e+01 -1.50680144e+01 2.25090957e+02
1716.lowfreq: -8.4583 -4.7598 -0.0016 -0.0014 0.0005 4.6423 8.4948 13.2660 18.7429
frequency: 7.9297 13.2572 18.4631 29.7395 33.3743 40.5062 57.3727 71.4941 81.3544 99.3842 110.4590 129.4184 142.0996 167.6979 181.0881 196.4637 226.1032 232.4943 253.0380 259.5257 271.5309 281.0727 313.6825 328.0913 330.0699 340.1582 364.8737 368.6366 396.8202 403.3512 410.9402 427.8201 437.9940 441.0777 444.0266 462.7746 474.8013 486.3258 495.3969 509.1132 524.6108 549.3295 571.4025 582.3475 606.9112 633.1700 644.4319 667.4431 688.2925 717.0225 722.3266 727.1990 732.9462 754.0798 776.7673 785.3689 820.0883 822.7647 823.2256 848.3938 850.6709 864.0952 873.9783 888.0435 900.2648 906.0798 931.4449 947.6633 962.8656 974.0448 974.3890 979.7869 988.4397 996.4298 1013.4810 1023.1670 1035.3207 1037.8583 1041.2101 1046.0244 1055.6106 1057.5584 1062.1827 1067.3437 1087.4640 1096.6226 1102.4142 1106.1068 1130.2890 1138.6471 1140.9014 1155.9616 1164.3542 1169.6566 1173.2092 1174.6092 1193.4815 1213.4556 1224.2670 1229.4371 1243.2026 1249.8595 1269.8258 1274.6377 1282.0886 1289.7261 1301.2617 1305.1244 1321.2592 1332.8012 1345.1164 1346.9270 1357.4174 1360.7688 1364.8551 1375.7464 1386.5066 1392.1180 1392.4999 1416.6087 1426.4056 1430.4980 1452.6755 1455.4895 1456.7754 1459.2680 1462.2361 1464.5755 1468.9947 1476.4668 1483.2461 1485.6039 1572.1805 1578.9809 1592.2781 1612.3775 2851.4463 2861.6466 2867.4492 2873.3916 2885.5683 2960.8719 2968.2040 2994.8954 3025.5570 3031.7207 3036.2627 3037.9673 3043.2444 3051.0698 3077.4698 3097.1585 3107.1187 3134.7297 3143.8386 3151.8051 3161.3320 3173.3189 3174.2968 3179.8672 3199.9881 3217.0771
redmass: 6.1925 12.5504 5.8167 3.0433 7.0566 4.6104 4.7398 5.7112 6.4173 2.9437 5.0859 4.5445 4.0063 2.9897 4.6997 3.8408 5.8520 6.1732 2.2881 5.6786 2.7562 3.2717 3.2855 3.2297 6.0966 3.1293 6.8491 3.8991 3.4619 2.0414 5.6166 5.1459 3.2647 3.2323 2.8296 5.7724 5.0496 3.1204 3.2778 8.4859 3.8510 3.6508 3.0430 3.5761 6.4057 9.1912 6.1242 6.1582 5.9545 4.0663 2.8737 3.1099 2.2405 1.3657 5.1696 1.1750 1.7398 1.3729 1.3629 1.5000 1.4024 3.2148 2.8939 1.4599 3.9995 3.0384 1.3750 1.3747 2.3775 1.4538 5.5414 2.2686 2.3452 2.7951 5.1298 6.6390 3.1049 1.3061 2.4870 2.2818 1.9226 1.8337 1.3220 2.2939 2.5657 2.8671 1.2448 2.3225 1.6522 2.4984 2.8106 1.4317 1.4825 1.8679 2.1605 1.0770 1.0851 1.4188 1.6360 2.2378 1.8280 1.4414 1.4397 1.3799 1.5780 2.0518 1.6452 1.3081 1.8818 1.3293 1.3324 1.3815 1.9701 1.4710 1.4118 5.7711 1.3883 2.2838 2.7625 3.0592 1.0911 2.3602 1.0825 1.1133 1.1048 1.3063 2.2579 1.1220 1.1675 1.1111 1.1613 2.8943 6.3268 7.3299 6.5567 6.8191 1.0710 1.0701 1.0700 1.0697 1.0691 1.0680 1.0859 1.0632 1.0893 1.0896 1.0912 1.0873 1.0887 1.0988 1.0936 1.0507 1.0625 1.0853 1.0905 1.0895 1.0936 1.1000 1.0913 1.0962 1.1172 1.1154
irintensity: 0.0624 0.0722 0.2037 0.0280 0.1112 0.4913 0.1852 1.3528 0.7491 0.0875 0.5475 1.7964 0.6596 0.1866 1.7751 2.2240 0.0276 2.2054 2.2037 0.4201 1.8355 1.5093 0.4918 5.7727 1.4236 3.5330 6.1339 3.0194 8.8433 4.3947 2.4210 7.3897 1.2778 1.4736 1.0219 17.4464 3.5497 0.6779 2.7598 3.8191 2.5473 3.9252 1.9001 7.9178 2.7522 2.3136 7.2380 3.6500 6.3986 1.5323 1.1807 1.8416 52.4757 84.1126 5.0930 3.6767 11.8762 53.7608 10.2162 0.5704 0.3301 16.6617 4.2176 53.2032 97.3279 16.9742 2.8618 6.3999 9.1113 25.4610 181.0846 5.2798 23.4947 17.1685 114.6180 50.2994 20.5294 39.9651 64.4656 9.2561 8.1684 6.2920 6.1549 82.5620 15.1436 16.4244 0.7865 1.1742 7.2625 20.9416 33.1229 9.6258 1.8362 9.8485 20.5179 0.4069 2.5929 29.8069 17.9331 110.3254 108.3547 34.4677 24.1719 14.7090 4.1173 74.8462 81.0777 33.8211 199.5523 3.7811 9.7911 4.6046 36.3987 14.2258 6.7357 9.8899 0.8188 9.0026 4.4997 163.6838 8.9858 23.2722 0.7584 3.1379 11.2744 56.4542 196.5899 3.9521 11.6919 2.5441 21.3534 14.0414 8.0373 34.7991 1.3291 36.3406 67.4805 17.2873 37.0119 64.7317 246.2830 40.9301 83.4714 31.8043 5.1898 28.6219 69.3710 50.7538 13.0934 48.9282 6.0955 21.1222 12.3597 1.3820 7.6637 2.5220 19.5308 16.0350 3.5998 0.6239 0.2347 30.6963
temp: 298.150 k
press: 1.00000 atm
elementType: 16 9 9 9 7 7 7 6 6 6 6 6 6 6 6 6 6 6 6 6 6 6 6 6 6 6 6 6 6 6 1 1 1 1 1 1 1 1 1 1 1 1 1 1 1 1 1 1 1 1 1 1 1 1 1 1
symmnumber: 1
zpe: 1173001.1 jmol-1
zpe.correction: 0.446773 hartree
zpe.thermalcorrener: 0.474184 hartree
zpe.thermalcorrenthalpy: 0.475128 hartree
zpe.thermalcorrgfe: 0.384737 hartree
zpe.sumelectzpe: -1751.625472 hartree
zpe.sumelectthermal: -1751.598061 hartree
zpe.sumelectthermalent: -1751.597116 hartree
zpe.sumelectthermalfe: -1751.687508 hartree
dipole: -4.0490 1.7272 0.6484
dipole: 4.4495
quadrupole: -202.0546 -180.6755 -180.0076
quadrupole: 9.0063 -13.4010 -1.9275
quadrupole: -14.4753 6.9037 7.5716 9.0063 -13.4010 -1.9275
hfenergy: -1752.0722446 hartree
pointgroup: C01 [X(C23H26F3N3S1)]
dipole: 1.6167015 0.648726 -0.1729587 debye
polarizability: 357.2721982|54.1919642|281.1033186|-36.2273766|23.1395104|228.8817839 unknown
InChI: InChI=1S/C23H26F3N3S/c24-23(25,26)17-6-9-22-20(16-17)29(19-4-1-2-5-21(19)30-22)11-3-10-27-12-14-28(15-13-27)18-7-8-18/h1-2,4-6,9,16,18H,3,7-8,10-15H2
charge 0 multiplicity 1
56 atoms
S  -1.396232 2.329916 1.983746
F  -6.744699 -1.24702 -0.345859
F  -5.186835 -1.829885 -1.895899
F  -5.232015 -2.868655 0.113683
N  5.073782 -1.248062 0.210211
N  2.186662 -1.340454 0.382861
N  -0.868092 0.518042 -0.437413
C  6.383119 -0.890431 -0.311997
C  7.521858 -0.662992 0.686931
C  7.51114 -1.92089 -0.200197
C  4.296087 -0.074471 0.679556
C  4.278801 -2.067604 -0.735603
C  2.985736 -0.533469 1.339759
C  2.964847 -2.517943 -0.075333
C  0.833362 -1.685266 0.882128
C  -0.176265 -1.900674 -0.269457
C  -0.290622 -0.643546 -1.161696
C  -2.193929 0.42907 0.067667
C  -0.224112 1.794497 -0.523961
C  -2.621477 1.258985 1.146307
C  -0.408773 2.768428 0.495086
C  -3.134623 -0.481182 -0.478681
C  0.596975 2.142645 -1.630592
C  -4.445264 -0.559945 0.04271
C  -3.942443 1.205725 1.631165
C  0.194979 4.038373 0.418921
C  -4.864702 0.282248 1.095595
C  1.235109 3.400087 -1.691089
C  1.039009 4.355793 -0.669956
C  -5.382589 -1.5903 -0.509989
H  6.392592 -0.251346 -1.21688
H  8.253196 0.121831 0.473434
H  7.282468 -0.803602 1.744815
H  7.263741 -2.866967 0.289677
H  8.236011 -1.992451 -1.016236
H  4.044797 0.616881 -0.16436
H  4.91018 0.484296 1.408931
H  4.877899 -2.95064 -1.02422
H  4.032989 -1.497044 -1.667567
H  2.392671 0.351565 1.635287
H  3.232688 -1.114787 2.2633
H  3.20501 -3.199387 0.779797
H  2.366157 -3.090006 -0.808006
H  0.47627 -0.84483 1.506479
H  0.847782 -2.5928 1.534499
H  -1.154458 -2.189139 0.157841
H  0.145756 -2.741674 -0.914683
H  0.742907 -0.378732 -1.436512
H  -0.853366 -0.863322 -2.092561
H  -2.854789 -1.122317 -1.317879
H  0.729205 1.436557 -2.454967
H  -4.243286 1.873753 2.444093
H  0.015594 4.768707 1.215061
H  -5.884932 0.224207 1.483714
H  1.872176 3.636236 -2.550259
H  1.525046 5.33519 -0.719607
