program: Gaussian 09
title: 000028622
version: EM64L-G09RevD.01
frameworkgroup: C1[X(C10H16N2)]
method: RPBEPBE
basis: SDD
operation: Freq
keyword: #pfreq=noraman
keyword: PBEPBE/SDD
title: #p freq=noraman PBEPBE/SDD
converged: YES YES NO NO
title: Mulliken charges:
elementType: N N C C C C C C C C C C H H H H H H H H H H H H H H H H
charge: -0.331291 -0.591463 -0.441104 0.057815 -0.564282 0.513662 -0.712412 -0.414009 -0.413181 -0.227940 -0.228331 -0.244118 0.227080 0.209044 0.173262 0.187827 0.206347 0.214413 0.246034 0.193905 0.244435 0.230605 0.231071 0.222747 0.222683 0.297520 0.262944 0.226740
chargesum: 0.00000
title: Mulliken charges with hydrogens summed into heavy atoms:
elementType: N N C C C C C C C C C C
charge: -0.086856 -0.030999 -0.004980 0.231077 -0.170109 0.513662 -0.058060 -0.183404 -0.182110 -0.005193 -0.005648 -0.017378
polarizability: 1.62232515e+02 -5.48965185e+00 1.10914049e+02 -1.05714999e+01 -1.20692388e+01 8.64248694e+01
1716.lowfreq: -19.0692 -10.9094 -0.0008 -0.0005 0.0005 1.4552 8.0237 29.5597 65.6054
frequency: -8.4099 28.6906 65.5679 102.1833 109.3774 193.5792 218.7200 234.5872 270.6904 322.1031 333.2156 363.4950 402.7159 414.9564 464.4324 519.0952 521.4466 589.0391 617.8723 672.1619 705.0922 758.7915 770.1304 808.7403 852.6121 865.3208 910.3170 926.9701 960.1898 975.0094 989.8004 993.1115 1021.2587 1028.1196 1055.9822 1096.8098 1112.0552 1125.3875 1153.5684 1171.3145 1183.4979 1185.9968 1217.6714 1225.5670 1262.3073 1280.3711 1314.9812 1326.9403 1335.3005 1346.6270 1372.7089 1382.5037 1440.3132 1452.3592 1456.4881 1474.4345 1478.4424 1483.0710 1483.6269 1593.1384 1614.1381 1647.2258 2853.6329 2970.9417 2978.6236 2989.3417 3019.2280 3054.0179 3076.7657 3092.8242 3112.6558 3113.3700 3130.3051 3142.1178 3161.2791 3359.0592 3407.9265 3592.3040
redmass: 3.2712 3.6311 3.6611 2.7345 2.9381 1.5451 1.5427 3.3899 2.9791 2.4135 1.2316 2.6466 2.8181 1.3278 2.5952 2.9044 2.7280 3.2537 6.3526 1.7173 1.7479 1.8609 1.2583 3.5822 1.2509 2.0111 1.6175 1.5059 1.6272 1.3878 6.1995 1.3169 3.2132 2.3058 1.5545 1.8787 1.6551 2.3090 1.9494 1.0560 1.4833 1.1140 2.4584 1.6781 1.3556 1.2164 1.3568 1.2549 1.3728 1.4237 1.2332 7.7302 2.1593 1.0703 1.0690 1.1241 1.1270 2.2838 1.0692 6.0272 6.1873 1.0877 1.0818 1.0587 1.0360 1.0593 1.1002 1.1033 1.0996 1.0992 1.0875 1.0867 1.0905 1.0957 1.1014 1.0739 1.0476 1.0961
irintensity: 0.4171 0.0558 1.6649 3.2072 1.4545 1.7442 2.6088 0.0562 10.2516 0.3047 40.0207 8.8911 0.0307 217.9104 4.1500 10.2491 4.3295 5.0718 0.0681 62.6589 52.6565 46.1240 16.2958 2.4892 0.0902 6.4916 2.2708 4.0205 0.4863 0.0252 0.0532 0.1395 0.8607 12.2638 8.3489 0.3187 10.9188 14.3691 1.3501 0.0535 6.2979 0.1932 0.0309 5.8105 3.4181 2.5714 8.0894 0.1395 8.5944 9.7457 23.7078 0.1841 7.6773 0.8615 7.6948 13.7599 7.5321 22.0372 3.7989 1.4591 12.3570 7.5113 82.5772 33.0564 22.9096 46.8674 7.4704 31.2332 50.1542 24.2238 8.9221 10.2949 10.1449 47.1647 24.8023 23.2227 21.2526 3.1892
temp: 298.150 k
press: 1.00000 atm
elementType: 7 7 6 6 6 6 6 6 6 6 6 6 1 1 1 1 1 1 1 1 1 1 1 1 1 1 1 1
symmnumber: 1
zpe: 636034.2 jmol-1
zpe.correction: 0.242253 hartree
zpe.thermalcorrener: 0.254273 hartree
zpe.thermalcorrenthalpy: 0.255217 hartree
zpe.thermalcorrgfe: 0.203524 hartree
zpe.sumelectzpe: -499.196737 hartree
zpe.sumelectthermal: -499.184716 hartree
zpe.sumelectthermalent: -499.183772 hartree
zpe.sumelectthermalfe: -499.235466 hartree
dipole: 0.0323 -0.9137 -1.3584
dipole: 1.6374
quadrupole: -70.8308 -68.3334 -74.4766
quadrupole: -6.3382 -6.5408 -1.5867
quadrupole: 0.3828 2.8802 -3.2630 -6.3382 -6.5408 -1.5867
hfenergy: -499.4389894 hartree
pointgroup: C01 [X(C10H16N2)]
dipole: -0.0023592 0.2942772 -0.5730658 debye
polarizability: 161.8261424|-4.6231878|113.4417319|12.3716784|8.7467295|84.3035592 unknown
InChI: InChI=1S/C10H16N2/c1-9(12-11)7-8-10-5-3-2-4-6-10/h2-6,9,12H,7-8,11H2,1H3
charge 0 multiplicity 1
28 atoms
N  -3.245527 0.845219 -0.12067
N  -4.55533 0.888042 -0.677262
C  -1.177804 -0.417836 0.364761
C  -2.67944 -0.529303 0.005853
C  -0.26761 0.078675 -0.797596
C  1.205271 0.078639 -0.413702
C  -3.462145 -1.31349 1.073673
C  1.801106 1.215606 0.191257
C  2.005561 -1.076852 -0.60967
C  3.156464 1.199806 0.591216
C  3.361407 -1.098522 -0.211843
C  3.942428 0.041086 0.391437
H  -1.068989 0.253218 1.239602
H  -0.819978 -1.415856 0.682775
H  -2.766321 -1.079137 -0.966321
H  -0.566331 1.101784 -1.102214
H  -0.43233 -0.578369 -1.674603
H  -3.298735 -0.867565 2.071801
H  -4.540577 -1.269633 0.844217
H  -3.144289 -2.372653 1.098455
H  -2.582694 1.490551 -0.579809
H  1.198471 2.119671 0.346961
H  1.56275 -1.963291 -1.081724
H  3.599863 2.088903 1.054318
H  3.964376 -1.999291 -0.374921
H  -5.187425 1.519628 -0.185456
H  -4.645467 0.881102 -1.701145
H  4.994294 0.027669 0.698509
