program: Gaussian 09
title: 000028633
version: EM64L-G09RevD.01
frameworkgroup: C1[X(C18H30N2O2)]
method: RPBEPBE
basis: SDD
operation: Freq
keyword: #p
keyword: freq=noraman
keyword: PBEPBE/SDD
title: #p freq=noraman PBEPBE/SDD
converged: YES YES NO NO
title: Mulliken charges:
elementType: O O N N C C C C C C C C C C C C C C C C C C H H H H H H H H H H H H H H H H H H H H H H H H H H H H H H
charge: -0.308952 -0.271890 -0.124835 -0.685565 -0.352191 -0.356531 -0.036788 -0.044449 -0.367817 -0.409356 -0.698460 -0.708621 -0.693433 -0.711602 -0.252943 0.199524 0.226439 -0.339325 -0.330993 -0.406941 -0.401486 0.499683 0.187753 0.190039 0.186785 0.192150 0.198021 0.212134 0.224439 0.194373 0.207604 0.195279 0.191634 0.210363 0.235847 0.210709 0.216526 0.203050 0.189134 0.215473 0.233234 0.201231 0.219213 0.208437 0.241130 0.225355 0.265976 0.261366 0.220668 0.218391 0.309762 0.310457
chargesum: 0.00000
title: Mulliken charges with hydrogens summed into heavy atoms:
elementType: O O N N C C C C C C C C C C C C C C C C C C
charge: -0.308952 -0.271890 -0.124835 -0.065346 0.025601 0.022403 0.161233 0.167685 0.050994 -0.006473 -0.060616 -0.078336 -0.055592 -0.082720 0.213541 0.199524 0.226439 -0.073349 -0.069627 -0.186272 -0.183095 0.499683
polarizability: 3.01478119e+02 -4.23845411e+01 1.80255342e+02 2.45352397e+00 -1.27261452e+01 1.97894552e+02
1716.lowfreq: -7.8351 -0.0005 0.0002 0.0009 0.8622 3.0629 7.3980 12.9047 19.9034
frequency: 6.9678 12.3084 19.8516 44.6556 47.7326 54.3259 57.1619 66.7454 78.1979 95.2407 117.7941 147.9604 177.4702 184.1916 193.9173 200.0317 202.6230 230.7525 238.8539 249.7435 285.4864 287.6231 294.0609 310.5034 323.8226 362.2843 370.3562 374.3421 394.6175 406.5540 406.7361 410.1090 415.4744 425.3722 449.1617 477.6921 507.9306 508.9394 546.3203 605.6747 634.2015 676.8646 741.7683 754.3695 784.4513 812.3944 815.8513 825.0368 825.3904 829.3556 843.6406 874.8148 890.4542 903.8014 911.7397 914.2107 917.0027 935.4514 949.3773 958.4003 961.5138 972.4089 984.9952 996.7333 1004.8369 1017.9202 1038.6895 1056.9014 1080.5778 1093.2948 1110.4020 1129.6931 1130.1195 1135.8000 1160.8659 1179.5237 1180.0736 1182.1862 1191.3246 1202.7967 1238.8731 1253.9365 1266.8639 1276.7596 1281.3885 1301.7342 1307.4560 1312.1298 1324.1739 1334.7966 1335.6759 1346.6885 1357.7731 1361.6557 1364.7232 1367.3746 1369.1968 1376.1340 1387.4207 1391.1657 1391.5347 1444.3381 1446.6131 1460.6819 1463.1312 1464.6456 1466.3781 1468.0983 1472.4291 1473.6583 1476.2728 1477.7861 1478.4283 1485.1971 1489.8549 1516.9538 1570.1172 1610.6190 1631.6617 1646.0512 2847.5733 2854.4529 2873.3401 2963.7874 2964.3577 2967.4177 2968.2326 2970.6817 2973.0620 2987.9765 3009.3281 3013.8698 3014.4267 3038.6071 3053.8297 3054.5482 3055.3658 3062.4170 3063.8825 3069.4436 3071.3949 3082.8743 3083.9848 3085.4972 3122.8742 3126.0028 3158.3065 3172.5891 3561.3315 3701.3243
redmass: 4.6466 4.8242 3.9164 3.4697 3.0681 3.4410 2.8917 3.2363 3.9587 5.0633 3.7320 4.7508 1.7099 1.5140 1.6346 1.3899 1.5264 1.4346 1.2544 2.7685 2.3711 3.3351 4.1497 3.1565 2.8674 3.4018 2.3292 2.0339 2.1019 1.4108 1.7536 1.1405 2.3082 2.1574 2.1803 3.3008 2.9746 3.1399 3.1338 6.5567 6.8852 4.0219 2.1881 4.4612 5.1498 2.5596 2.6958 2.1627 1.4702 4.5095 1.8322 2.4809 1.9041 1.4494 1.2981 1.6424 1.3174 1.6497 1.5886 1.5084 1.6753 1.3605 1.3495 3.0799 1.9379 1.4753 2.3966 4.3640 2.0850 2.1409 2.1002 2.2407 1.2349 2.2818 1.7995 1.1778 1.8419 1.9052 1.5243 1.5760 1.4550 2.5811 1.2144 1.3084 1.1671 1.4253 1.3216 1.4745 2.8296 1.4169 1.4181 1.4000 1.5680 1.3333 1.3202 1.2425 1.2572 1.3479 1.2214 3.8424 1.3378 1.0937 4.1701 1.0627 1.0663 1.0524 1.0494 1.0774 1.0714 1.0743 1.0775 1.0537 1.0516 1.0584 1.0534 3.1891 7.3299 10.1091 3.2812 1.4266 1.0706 1.0707 1.0714 1.0360 1.0364 1.0441 1.0416 1.0754 1.0767 1.0601 1.0877 1.0616 1.0873 1.0951 1.0982 1.0986 1.0931 1.0981 1.0978 1.0989 1.0989 1.0995 1.1036 1.1005 1.0895 1.0890 1.0953 1.0947 1.0450 1.1040
irintensity: 0.9592 0.5771 0.2139 0.8435 0.4115 0.3954 0.4607 0.4516 0.4080 1.0516 1.3375 0.2302 0.6427 0.9460 1.1909 2.7145 1.8057 0.2734 1.8701 7.3695 1.6501 3.4518 10.9652 0.2259 2.8112 9.1555 1.1435 0.3560 2.3958 189.1921 94.9231 27.2159 0.4888 1.4463 3.7186 5.6753 3.4051 0.5738 0.2602 13.2226 1.8406 30.4338 17.3581 12.7061 3.8535 1.4881 2.8794 2.1408 0.8399 2.8857 70.4443 10.4435 17.4233 1.5869 1.6384 17.2756 11.0811 6.5499 0.4291 5.1062 1.6781 0.4046 0.1993 34.7458 1.9321 10.0476 26.9883 335.3717 66.9679 84.4601 14.3838 4.8897 12.9535 5.5674 7.1477 187.9218 4.5579 2.3569 9.2463 1.3247 53.7784 312.4536 3.2704 4.7836 6.3517 0.7544 2.2587 2.3957 101.2890 1.6885 5.0987 14.6475 7.2254 0.9988 2.8890 9.7372 23.2951 16.0631 25.4063 12.6619 6.3359 10.2425 5.6837 0.1986 1.2974 4.8007 0.7533 7.0269 7.4419 17.7243 18.8582 8.2073 9.5126 15.0738 26.1642 68.5000 28.3841 317.3967 97.7661 323.3505 34.4779 95.7262 186.8577 34.9311 47.4099 19.1259 19.1218 25.2510 18.2186 29.4011 15.1054 43.0570 36.5553 14.8364 10.0334 19.9937 48.1388 56.9364 111.4242 50.7900 48.5292 59.7601 45.5703 0.3528 16.1547 22.3811 9.6298 4.0123 109.6488 22.7019
temp: 298.150 k
press: 1.00000 atm
elementType: 8 8 7 7 6 6 6 6 6 6 6 6 6 6 6 6 6 6 6 6 6 6 1 1 1 1 1 1 1 1 1 1 1 1 1 1 1 1 1 1 1 1 1 1 1 1 1 1 1 1 1 1
symmnumber: 1
zpe: 1182281.1 jmol-1
zpe.correction: 0.450307 hartree
zpe.thermalcorrener: 0.475744 hartree
zpe.thermalcorrenthalpy: 0.476688 hartree
zpe.thermalcorrgfe: 0.391189 hartree
zpe.sumelectzpe: -962.142665 hartree
zpe.sumelectthermal: -962.117228 hartree
zpe.sumelectthermalent: -962.116284 hartree
zpe.sumelectthermalfe: -962.201782 hartree
dipole: -2.8897 2.4155 -3.1890
dipole: 4.9351
quadrupole: -92.1021 -138.3090 -134.9093
quadrupole: -13.0906 3.1450 2.6231
quadrupole: 29.6714 -16.5355 -13.1358 -13.0906 3.1450 2.6231
hfenergy: -962.5929718 hartree
pointgroup: C01 [X(C18H30N2O2)]
dipole: -1.0821247 1.0874988 -1.1900373 debye
polarizability: 300.220837|-43.6481577|184.2348535|1.4871711|-15.6545798|195.172323 unknown
InChI: InChI=1S/C18H30N2O2/c1-14(2)12-20(13-15(3)4)10-5-11-22-18(21)16-6-8-17(19)9-7-16/h6-9,14-15H,5,10-13,19H2,1-4H3
charge 0 multiplicity 1
52 atoms
O  -0.648753 -1.277733 -0.59576
O  -1.321323 -1.917811 1.545898
N  2.752831 0.378973 -0.598693
N  -6.5690 1.212646 -0.708159
C  4.194051 0.079596 -0.808809
C  2.495093 1.811128 -0.286891
C  5.002324 -0.074463 0.506913
C  1.239377 2.041935 0.595376
C  1.89193 -0.131172 -1.698917
C  1.553111 -1.631939 -1.550168
C  4.56079 -1.332471 1.286437
C  6.517774 -0.106407 0.199469
C  1.452587 1.488415 2.021467
C  0.881328 3.54637 0.624039
C  0.672787 -1.920424 -0.335084
C  -1.579334 -1.344769 0.454027
C  -2.855747 -0.674688 0.115071
C  -3.888303 -0.647502 1.091924
C  -3.090754 -0.058652 -1.144441
C  -5.116422 -0.025806 0.82713
C  -4.316412 0.565833 -1.421169
C  -5.352717 0.594066 -0.438288
H  4.677492 0.862762 -1.447384
H  4.273195 -0.872567 -1.370061
H  2.400618 2.414173 -1.226262
H  3.373793 2.212539 0.255046
H  4.795749 0.812472 1.141084
H  0.390488 1.49265 0.137711
H  0.942525 0.432984 -1.692166
H  2.362689 0.043694 -2.698077
H  1.044137 -1.986408 -2.467787
H  2.484616 -2.222585 -1.445523
H  4.830662 -2.251634 0.729036
H  5.049112 -1.383051 2.277263
H  3.466882 -1.327639 1.436512
H  6.850365 0.821416 -0.303664
H  7.107758 -0.2216 1.127358
H  6.766262 -0.958709 -0.463026
H  2.219475 2.080733 2.559357
H  0.517813 1.525915 2.610185
H  1.79435 0.439383 1.979768
H  1.716091 4.141285 1.044473
H  -0.009116 3.727304 1.253467
H  0.666866 3.933075 -0.39064
H  1.102952 -1.484753 0.583246
H  0.509067 -3.002112 -0.178249
H  -3.699528 -1.125247 2.059267
H  -2.300679 -0.080772 -1.900506
H  -5.902514 -0.013344 1.591873
H  -4.484872 1.035923 -2.397843
H  -6.742714 1.652636 -1.60734
H  -7.308952 1.233449 -0.012188
