program: Gaussian 09
title: 000028635
version: EM64L-G09RevD.01
frameworkgroup: C1[X(C15H24N2O2)]
method: RPBEPBE
basis: SDD
operation: Freq
keyword: #p
keyword: freq=noraman
keyword: PBEPBE/SDD
title: #p freq=noraman PBEPBE/SDD
converged: YES YES NO NO
title: Mulliken charges:
elementType: O O N N C C C C C C C C C C C C C C C H H H H H H H H H H H H H H H H H H H H H H H H
charge: -0.294018 -0.270834 -0.104848 -0.685301 -0.356360 -0.376104 -0.380728 -0.322557 -0.322409 -0.272120 -0.676839 -0.673161 0.179156 0.226381 -0.335671 -0.326881 -0.407897 -0.400937 0.499744 0.183594 0.200092 0.190047 0.215270 0.205904 0.206282 0.185237 0.205223 0.184361 0.202832 0.224723 0.225354 0.228696 0.206852 0.205290 0.228436 0.208306 0.204934 0.265309 0.265021 0.220581 0.218650 0.310474 0.309917
chargesum: 0.00000
title: Mulliken charges with hydrogens summed into heavy atoms:
elementType: O O N N C C C C C C C C C C C C C C C
charge: -0.294018 -0.270834 -0.104848 -0.064910 0.027326 0.029213 0.031458 0.067904 0.064783 0.177957 -0.036001 -0.031484 0.179156 0.226381 -0.070362 -0.061860 -0.187316 -0.182287 0.499744
polarizability: 2.87204031e+02 2.11423822e+01 1.81056137e+02 8.05444228e+00 1.39133958e+01 1.25152219e+02
1716.lowfreq: -21.5171 -4.3534 -2.5502 -0.0004 0.0008 0.0013 6.9981 17.3752 30.3525
frequency: -13.4253 17.2551 30.3409 44.5132 63.0654 72.8421 76.0295 77.6740 103.7342 105.6904 119.7427 157.3982 168.1644 172.9637 205.5141 228.3059 277.0770 292.7243 293.6126 297.8672 351.8769 372.8040 382.7230 407.9229 411.8260 415.9836 425.4110 457.9442 491.6622 508.2308 528.4553 607.7329 634.0020 678.1930 738.5509 743.8797 755.5229 780.7732 789.7971 794.1868 798.4245 825.6184 826.5553 844.0374 897.0428 915.0259 933.7498 973.4336 981.0022 984.4428 998.2210 1018.3220 1038.1295 1045.8750 1062.3839 1073.5481 1077.5191 1083.6191 1084.4008 1099.9182 1130.2579 1132.5096 1159.8886 1179.8415 1203.4090 1211.6460 1243.9634 1254.4249 1262.1865 1278.3952 1282.5727 1292.0384 1298.1633 1308.0959 1324.0482 1330.9647 1361.1567 1366.5440 1375.4168 1379.0072 1385.9585 1386.1870 1392.3948 1447.3899 1458.5080 1460.6228 1467.2907 1469.6972 1471.2207 1478.0971 1480.1945 1486.4231 1489.0934 1490.7555 1516.6783 1570.4561 1610.9670 1631.9579 1646.5103 2840.9754 2843.7714 2858.6991 2976.4248 2981.9896 2983.0562 2984.4792 2997.4252 3017.6283 3027.4138 3031.3068 3035.2739 3048.3901 3070.7722 3073.8942 3075.2952 3091.3461 3092.2248 3123.1561 3126.0024 3158.3587 3173.1777 3561.4493 3701.4615
redmass: 3.8272 4.1007 4.4619 3.5686 2.8654 2.0779 2.0502 3.9311 3.4586 2.4026 2.6010 3.3221 3.0884 1.6781 1.2845 2.9640 2.1340 4.7665 2.3994 3.1871 4.6400 3.0862 3.3204 1.2064 1.3229 1.8459 3.1325 3.0503 2.8879 2.8414 4.4326 6.4161 6.9102 3.9965 1.6951 1.4372 4.4103 5.4802 1.1781 1.1318 1.2602 1.2647 5.9888 1.8416 1.5609 6.5528 1.5237 1.3640 2.4113 1.3508 3.1759 1.4745 3.1216 3.4674 4.2359 1.9576 2.4661 1.8513 2.1911 2.7342 1.2172 1.7131 1.4092 1.1378 2.1684 1.8328 1.3633 2.2462 1.3116 1.0967 1.1588 1.2353 1.1843 1.3205 2.5716 1.5212 1.3253 1.3364 1.6024 1.4262 1.2304 1.2362 4.9086 4.1623 1.0594 1.0535 1.0710 1.0710 1.0648 1.0581 1.0742 1.0704 1.0899 1.0758 3.1995 7.3394 10.2105 3.3402 1.4170 1.0714 1.0723 1.0711 1.0609 1.0358 1.0358 1.0597 1.0569 1.0886 1.0963 1.0880 1.0872 1.1035 1.1069 1.0987 1.0978 1.1003 1.1002 1.0893 1.0893 1.0953 1.0948 1.0450 1.1040
irintensity: 0.6585 0.0561 0.6806 0.6352 0.6174 2.0146 0.7622 0.1310 0.3827 0.7446 0.1932 2.1371 1.0984 2.4104 0.3764 3.5890 1.8117 9.9342 0.0894 3.4076 0.8307 8.6285 9.3073 239.4321 69.7451 7.1566 4.0004 4.1366 9.5714 3.5514 5.9876 9.8900 2.1307 26.5307 12.2341 3.4383 11.9430 27.0444 1.9337 5.4395 1.7030 0.4856 3.2897 72.7463 1.5909 14.0906 0.0290 0.1455 4.9975 0.2178 35.3221 15.0568 1.3066 120.9474 313.8249 7.2417 73.8491 9.2827 34.5970 7.0813 12.6217 5.5259 5.1639 200.7992 23.8606 22.1484 39.6360 310.2520 43.1306 1.1601 9.5849 31.5117 20.0486 1.8513 98.0839 24.8933 3.5046 5.4550 4.2150 3.2998 22.0760 19.4702 12.2059 6.3256 2.4434 6.2008 1.8022 1.9262 0.4264 1.6857 5.9114 6.5906 20.6190 12.9731 70.6147 30.5678 347.9382 103.3591 317.8606 41.3656 33.1406 243.4335 7.0605 33.6426 34.0368 19.6359 46.0802 12.2123 3.1033 14.1233 21.6658 18.9599 67.9607 59.9180 89.8750 34.2228 49.0368 15.5616 23.1746 9.6722 3.9045 109.7397 22.9224
temp: 298.150 k
press: 1.00000 atm
elementType: 8 8 7 7 6 6 6 6 6 6 6 6 6 6 6 6 6 6 6 1 1 1 1 1 1 1 1 1 1 1 1 1 1 1 1 1 1 1 1 1 1 1 1
symmnumber: 1
zpe: 964382.5 jmol-1
zpe.correction: 0.367314 hartree
zpe.thermalcorrener: 0.388014 hartree
zpe.thermalcorrenthalpy: 0.388958 hartree
zpe.thermalcorrgfe: 0.315696 hartree
zpe.sumelectzpe: -844.467898 hartree
zpe.sumelectthermal: -844.447198 hartree
zpe.sumelectthermalent: -844.446254 hartree
zpe.sumelectthermalfe: -844.519516 hartree
dipole: -2.4859 -3.6743 -1.8337
dipole: 4.8003
quadrupole: -65.3475 -115.5597 -119.3559
quadrupole: 12.2557 1.8394 -0.0662
quadrupole: 34.7402 -15.4720 -19.2682 12.2557 1.8394 -0.0662
hfenergy: -844.8352117 hartree
pointgroup: C01 [X(C15H24N2O2)]
dipole: 0.9825342 -1.3587958 0.8689113 debye
polarizability: 287.2582105|-20.7375756|177.3850294|8.5561047|-19.6308789|128.7691482 unknown
InChI: InChI=1S/C15H24N2O2/c1-3-17(4-2)11-5-6-12-19-15(18)13-7-9-14(16)10-8-13/h7-10H,3-6,11-12,16H2,1-2H3
charge 0 multiplicity 1
43 atoms
O  0.939838 0.194095 -0.180269
O  1.879466 2.109182 -1.128024
N  -5.328133 -0.255574 0.176412
N  7.125522 -1.372086 0.544406
C  -3.932077 -0.712289 0.402669
C  -2.88161 0.267227 -0.164204
C  -1.435832 -0.215942 0.096427
C  -5.754629 0.775939 1.161595
C  -6.295227 -1.381381 0.071295
C  -0.405615 0.762655 -0.467693
C  -6.877249 1.68838 0.63094
C  -6.222381 -2.110678 -1.284351
C  2.032032 0.986507 -0.576233
C  3.329639 0.345882 -0.268595
C  4.525723 1.037361 -0.604111
C  3.428283 -0.932523 0.345753
C  5.782285 0.476422 -0.337773
C  4.6806 -1.504075 0.616302
C  5.881952 -0.80866 0.278773
H  -3.728073 -0.888802 1.490822
H  -3.800259 -1.688908 -0.099512
H  -3.022376 1.272152 0.282504
H  -3.063922 0.378986 -1.250335
H  -1.28029 -1.211037 -0.364573
H  -1.263776 -0.334464 1.18417
H  -6.071536 0.308099 2.129428
H  -4.8751 1.403689 1.394982
H  -6.159846 -2.117182 0.905732
H  -7.312047 -0.964201 0.187293
H  -0.477589 1.761837 0.001329
H  -0.508466 0.89218 -1.561533
H  -6.550058 2.188394 -0.297051
H  -7.798853 1.121965 0.404596
H  -7.135272 2.460129 1.380356
H  -6.415286 -1.399485 -2.10621
H  -5.230353 -2.566675 -1.456294
H  -6.974602 -2.920692 -1.329743
H  4.440849 2.021389 -1.077536
H  2.510111 -1.467137 0.605186
H  6.69574 1.022519 -0.602907
H  4.742713 -2.491672 1.089576
H  7.98224 -0.881429 0.304304
H  7.201764 -2.286896 0.979893
