program: Gaussian 09
title: 000028598
version: EM64L-G09RevD.01
frameworkgroup: C1[X(C20H12O)]
method: RPBEPBE
basis: SDD
operation: Freq
keyword: #pfreq=noraman
keyword: PBEPBE/SDD
title: #p freq=noraman PBEPBE/SDD
converged: NO YES NO NO
title: Mulliken charges:
elementType: O C C C C C C C C C C C C C C C C C C C C H H H H H H H H H H H H
charge: -0.431902 0.012215 -0.007535 0.299398 0.528281 0.206228 0.495762 0.477359 0.482569 -0.828229 -0.434567 -0.508014 -0.520062 -0.485136 -0.469651 -0.469693 -0.501404 -0.444388 -0.244879 0.285609 -0.415305 0.248405 0.226791 0.241409 0.236590 0.236407 0.243103 0.240459 0.249440 0.244999 0.226436 0.222414 0.356893
chargesum: 0.00000
title: Mulliken charges with hydrogens summed into heavy atoms:
elementType: O C C C C C C C C C C C C C C C C C C C C
charge: -0.075009 0.012215 -0.007535 0.299398 0.528281 0.206228 0.495762 0.477359 0.482569 -0.579824 -0.207776 -0.266605 -0.283472 -0.248728 -0.226548 -0.229234 -0.251964 -0.199389 -0.018443 0.285609 -0.192891
polarizability: 4.52877840e+02 1.62177566e+01 2.45895335e+02 -2.34945674e-03 1.14052954e-03 8.12164853e+01
1716.lowfreq: 0.0001 0.0005 0.0008 6.9265 7.7675 16.4775 54.2356 79.3858 151.9843
frequency: 54.2280 79.3840 151.9842 168.6832 171.3903 216.8199 226.1952 303.7519 305.6336 328.0280 334.2333 345.8843 416.8782 425.9785 434.8118 461.1393 479.5171 508.3956 511.4928 519.5780 523.7829 549.2351 551.6398 586.8640 607.7619 618.1494 685.3400 692.5246 712.6786 752.1599 765.9473 769.0494 796.8703 800.5258 806.7084 828.7016 847.0914 853.5543 869.3598 884.9530 912.3484 921.8494 936.5717 954.8071 975.7120 980.5941 983.9948 990.4255 1028.2576 1079.5842 1115.9978 1128.8993 1150.3575 1161.7396 1176.6112 1192.9943 1205.7435 1216.1394 1234.8347 1257.5089 1266.8996 1291.2695 1310.9007 1330.7379 1397.8394 1402.4573 1408.0732 1416.6972 1427.1393 1437.3682 1446.9266 1466.0029 1493.8876 1498.3389 1520.8357 1567.9619 1588.1928 1605.0224 1609.5581 1631.2510 1645.1674 3113.2046 3117.0702 3118.8330 3121.4955 3126.4803 3131.0781 3141.4043 3143.4308 3155.4419 3157.9499 3176.8753 3582.9295
redmass: 5.8524 4.7745 4.5077 6.0252 4.5304 4.0252 4.3788 7.4011 4.7196 6.3532 1.3010 2.8174 3.4097 4.6028 5.5804 3.1876 6.1906 5.7418 3.6498 5.1484 3.2188 6.6801 2.8880 5.9855 3.7281 7.3795 6.9562 3.5648 3.0950 6.0101 1.8895 1.2960 5.9661 1.4644 5.3143 1.5949 4.6007 1.7858 2.4265 1.8735 1.5655 1.6890 5.0076 1.5439 1.3898 5.7236 1.3976 1.4358 3.5453 2.0038 2.4941 1.7679 1.3896 1.2438 1.2409 1.2894 1.4245 1.7268 1.7264 1.8644 2.0010 2.5645 2.2954 3.2068 4.8195 2.0803 3.6368 4.2106 3.0009 3.6148 4.8753 4.5564 3.3273 4.6569 4.7959 5.8308 6.8998 6.2869 6.7628 7.0138 6.7233 1.0873 1.0885 1.0886 1.0859 1.0878 1.0915 1.0971 1.0983 1.0990 1.0957 1.0901 1.0661
irintensity: 0.4930 1.5621 3.3575 1.9489 0.1380 6.8636 0.6846 2.0540 0.5567 3.8485 121.8420 21.3025 2.5244 7.2529 2.9899 2.1202 0.2089 2.2293 0.8476 12.3932 5.1038 0.7510 2.5868 1.5213 4.9086 2.8485 0.0908 0.5721 25.9122 2.6556 36.9155 15.9229 35.0298 18.1584 1.5673 0.0645 0.1692 15.4355 36.8358 56.1059 5.8979 31.8526 42.0044 19.1142 3.6479 0.9071 3.6159 0.0566 6.6106 14.3269 21.7812 4.9118 269.3002 26.1615 1.3790 9.8667 22.8101 31.6685 6.1526 17.2493 10.4398 1.9862 48.8302 3.7546 11.9332 0.2775 6.6180 3.4465 3.6978 0.1891 5.0175 14.3798 71.1994 1.8873 26.0536 18.5763 0.4966 9.7551 11.2124 57.3684 79.7531 13.6698 3.1955 7.7805 0.6667 3.4075 16.9919 24.9373 43.4203 46.5639 18.3613 10.7089 84.6479
temp: 298.150 k
press: 1.00000 atm
elementType: 8 6 6 6 6 6 6 6 6 6 6 6 6 6 6 6 6 6 6 6 6 1 1 1 1 1 1 1 1 1 1 1 1
symmnumber: 1
zpe: 666323.5 jmol-1
zpe.correction: 0.253789 hartree
zpe.thermalcorrener: 0.268036 hartree
zpe.thermalcorrenthalpy: 0.268981 hartree
zpe.thermalcorrgfe: 0.213471 hartree
zpe.sumelectzpe: -843.231357 hartree
zpe.sumelectthermal: -843.217110 hartree
zpe.sumelectthermalent: -843.216166 hartree
zpe.sumelectthermalfe: -843.271675 hartree
dipole: 1.4103 1.3377 0.0001
dipole: 1.9438
quadrupole: -89.1334 -107.1927 -129.3540
quadrupole: 6.9478 0.0002 0.0000
quadrupole: 19.4267 1.3673 -20.7940 6.9478 0.0002 0.0000
hfenergy: -843.4851464 hartree
pointgroup: C01 [X(C20H12O1)]
dipole: -0.5626701 -0.5179109 0.0000198 debye
polarizability: 453.3169059|13.1127353|245.4562685|0.0023321|-0.0011756|81.2164853 unknown
InChI: InChI=1S/C20H12O/c21-16-8-6-14-10-15-5-4-12-2-1-3-13-7-9-17(18(14)11-16)20(15)19(12)13/h1-11,21H
charge 0 multiplicity 1
33 atoms
O  -5.268453 1.727572 -0.000041
C  0.58942 -0.289189 0.00003
C  1.973477 0.110967 0.000043
C  -0.453182 0.698155 0.000006
C  0.260092 -1.707383 0.000036
C  -1.845984 0.275586 -0.000001
C  2.322971 1.51032 0.000032
C  3.023224 -0.882117 0.000056
C  -2.146205 -1.145957 0.000019
C  -1.087106 -2.100335 0.000029
C  -0.07161 2.088964 0.000004
C  1.337047 -2.679181 0.000056
C  1.258449 2.480718 0.000013
C  2.659098 -2.286711 0.000061
C  3.697235 1.890671 0.000038
C  4.377032 -0.461749 0.000055
C  -2.934331 1.200124 0.0000
C  -3.51699 -1.569429 0.000018
C  4.70927 0.913948 0.00005
C  -4.257815 0.75004 0.000003
C  -4.562039 -0.64892 -0.000004
H  -1.336525 -3.168964 0.00004
H  -0.846688 2.86074 -0.00001
H  1.072707 -3.743369 0.000059
H  1.518623 3.545807 0.000002
H  3.462878 -3.032367 0.000072
H  3.955583 2.956049 0.000028
H  5.170688 -1.218216 0.000063
H  -2.768389 2.279741 0.000001
H  -3.734717 -2.643628 0.000023
H  5.761679 1.218406 0.000053
H  -5.606295 -0.987739 -0.000022
H  -6.165844 1.311444 -0.000012
