program: Gaussian 09
title: 000028572
version: EM64L-G09RevD.01
frameworkgroup: C1[X(C11H18ClN3S2)]
method: RPBEPBE
basis: SDD
operation: Freq
keyword: #p
keyword: freq=noraman
keyword: PBEPBE/SDD
title: #p freq=noraman PBEPBE/SDD
converged: YES YES NO NO
title: Mulliken charges:
elementType: Cl S S N N N C C C C C C C C C C C H H H H H H H H H H H H H H H H H H
charge: 0.021362 0.308517 0.308507 0.070276 0.094385 0.094399 -0.324713 -0.324705 -0.344013 -0.344044 -0.654222 -0.654166 -0.684152 -0.684130 -0.295844 -0.295862 -0.309512 0.212023 0.212039 0.212046 0.212029 0.197112 0.197141 0.197134 0.197129 0.272043 0.271871 0.271981 0.271890 0.220641 0.213053 0.213046 0.220641 0.213052 0.213043
chargesum: 0.00000
title: Mulliken charges with hydrogens summed into heavy atoms:
elementType: Cl S S N N N C C C C C C C C C C C
charge: 0.021362 0.308517 0.308507 0.070276 0.094385 0.094399 0.099349 0.099371 0.050239 0.050220 -0.110308 -0.110295 -0.037412 -0.037394 -0.295844 -0.295862 -0.309512
polarizability: 2.71444945e+02 4.45746688e-03 2.26463128e+02 -6.99545454e-03 5.69754744e-02 1.05095363e+02
1716.lowfreq: -4.5983 -0.0010 0.0010 0.0020 6.4272 7.7371 19.4186 30.8751 32.0703
frequency: 19.1308 30.8743 31.8546 46.2544 48.7706 61.6489 93.8302 96.2197 116.6831 117.2705 137.7942 138.5818 159.2790 162.0652 165.3026 180.4683 211.9963 233.1254 233.2069 294.8538 298.3117 378.7383 391.2217 429.5533 435.0958 444.5789 503.4300 611.7825 616.5680 693.0809 694.6709 737.1744 737.7729 781.6496 782.1217 784.6457 787.6065 788.2297 884.6512 896.0260 896.2793 912.9334 913.9897 1026.8234 1027.1764 1067.1188 1068.6850 1073.2889 1073.7471 1103.6928 1103.8453 1157.9071 1183.9280 1201.7406 1203.2284 1215.8342 1232.8427 1241.7801 1253.0279 1268.8244 1270.3822 1293.0240 1293.5942 1306.5264 1310.2743 1350.1260 1351.2151 1390.4850 1394.1502 1394.2915 1427.1114 1438.2006 1444.7613 1469.2144 1470.0266 1476.2302 1476.7003 1479.0657 1479.1461 1487.6206 1487.9235 2971.1272 2971.6111 2978.3493 2978.4230 2984.3433 2984.6393 3014.7139 3014.8552 3035.7523 3036.9003 3044.8619 3044.9623 3076.4838 3076.6589 3078.8944 3079.0411 3115.1724 3115.2410
redmass: 5.5869 3.8336 5.9013 1.6352 1.6186 5.3836 3.0276 3.4987 2.0179 1.9033 12.7902 3.8921 7.1168 11.5536 9.2928 4.5062 6.8134 1.1174 1.1189 4.5940 5.4073 6.6483 3.1716 17.2096 4.5734 14.3199 9.0631 12.0776 12.3396 6.7594 7.0385 1.0705 1.0699 1.1526 1.6614 2.8891 13.7122 13.7768 13.2197 1.8152 1.7993 1.2046 1.2030 3.7728 3.8014 1.1515 1.1539 2.5211 2.5421 2.2446 2.2569 10.4288 11.9140 1.5066 1.5039 9.0598 2.1356 1.2910 2.2215 1.2069 1.2072 1.0633 1.0628 1.3396 1.3515 1.5222 1.5130 12.2361 1.2117 1.2104 10.4439 1.0945 1.0915 1.0693 1.0706 1.0655 1.0619 1.0417 1.0417 1.0826 1.0845 1.0585 1.0585 1.0371 1.0372 1.0591 1.0589 1.1005 1.1006 1.0569 1.0568 1.1041 1.1041 1.1011 1.1012 1.0995 1.0994 1.1086 1.1087
irintensity: 0.0000 0.0004 0.0588 0.0002 0.3644 0.0214 0.0002 1.5276 0.6609 0.0005 0.1034 0.0543 0.0297 0.0000 0.0365 0.7590 7.0614 0.0012 0.0323 0.7435 0.0044 4.4566 1.9363 4.5556 3.8131 1.1457 0.0002 0.0000 0.1792 5.9243 13.5716 0.0008 24.5528 0.0144 1.0709 1.4259 209.0819 96.0455 6.9294 7.0159 0.1548 0.0003 5.2429 1.3023 3.0952 0.0004 0.1106 0.3745 1.0338 39.2868 2.8701 84.4716 263.7469 0.0000 0.5443 177.4143 31.1552 5.9592 2.4455 0.0007 0.3615 0.0003 0.9814 10.4902 16.0965 14.1670 13.2232 780.0529 7.1328 2.8746 921.3822 1.1979 0.0954 0.3246 1.8609 6.1598 3.1188 0.0041 26.7238 23.6633 9.7800 32.5901 1.1526 30.8847 33.7193 88.2238 0.6017 0.0436 5.0790 24.8509 3.3358 0.2928 38.5918 5.9378 128.0266 19.6465 65.7297 1.4142 42.9532
temp: 298.150 k
press: 1.00000 atm
elementType: 17 16 16 7 7 7 6 6 6 6 6 6 6 6 6 6 6 1 1 1 1 1 1 1 1 1 1 1 1 1 1 1 1 1 1
symmnumber: 1
zpe: 727179.5 jmol-1
zpe.correction: 0.276968 hartree
zpe.thermalcorrener: 0.297678 hartree
zpe.thermalcorrenthalpy: 0.298622 hartree
zpe.thermalcorrgfe: 0.223318 hartree
zpe.sumelectzpe: -1849.070734 hartree
zpe.sumelectthermal: -1849.050024 hartree
zpe.sumelectthermalent: -1849.049080 hartree
zpe.sumelectthermalfe: -1849.124383 hartree
dipole: 7.2391 0.0008 0.0022
dipole: 7.2391
quadrupole: -133.4581 -125.0745 -123.9108
quadrupole: -0.0016 0.0069 -0.0001
quadrupole: -5.9770 2.4066 3.5703 -0.0016 0.0069 -0.0001
hfenergy: -1849.3477016 hartree
pointgroup: C01 [X(C11H18Cl1N3S2)]
dipole: 2.8480727 -0.0113196 -0.0010161 debye
polarizability: 271.4442409|-0.1780754|226.4586466|0.002251|0.7953977|105.1005492 unknown
InChI: InChI=1S/C11H18ClN3S2/c1-3-5-7-16-10-13-9(12)14-11(15-10)17-8-6-4-2/h3-8H2,1-2H3
charge 0 multiplicity 1
35 atoms
Cl -5.415794 0.023116 -0.001357
S  -0.828098 -2.746458 -0.017952
S  -0.805656 2.754985 0.020125
N  -0.904052 0.004606 0.001322
N  -3.007134 1.223951 0.008781
N  -3.017099 -1.19742 -0.008208
C  1.866149 -3.507165 -0.020717
C  1.894476 3.49431 0.020959
C  3.377859 -3.16886 -0.020665
C  3.403494 3.144159 0.017727
C  1.003718 -2.234823 -0.017895
C  1.022069 2.228766 0.016228
C  4.258934 -4.436936 -0.023194
C  4.294356 4.405408 0.022478
C  -1.643474 -1.144913 -0.00711
C  -1.633976 1.160153 0.009258
C  -3.608303 0.015729 -0.000025
H  1.630392 -4.122077 -0.911727
H  1.631087 -4.125394 0.86816
H  1.662915 4.116627 -0.865983
H  1.664867 4.10875 0.913897
H  3.616744 -2.552033 0.86909
H  3.616157 -2.548841 -0.908367
H  3.638273 2.519856 0.90336
H  3.636285 2.52798 -0.874088
H  1.171654 -1.617728 0.879408
H  1.170931 -1.614252 -0.912932
H  1.184014 1.612609 -0.882818
H  1.185684 1.604784 0.909557
H  5.333392 -4.178846 -0.022354
H  4.060091 -5.056062 -0.917742
H  4.059618 -5.059911 0.868562
H  5.366799 4.139075 0.01926
H  4.101586 5.023467 0.919079
H  4.098441 5.032388 -0.867216
