program: Gaussian 09
title: 000028561
version: EM64L-G09RevD.01
frameworkgroup: C1[X(C8H7N3S)]
method: RPBEPBE
basis: SDD
operation: Freq
keyword: #pfreq=noraman
keyword: PBEPBE/SDD
title: #p freq=noraman PBEPBE/SDD
converged: YES YES NO NO
title: Mulliken charges:
elementType: S N N N C C C C C C C C H H H H H H H
charge: 0.333465 -0.076626 -0.422807 -0.549827 0.323325 0.095605 -0.362583 -0.338540 -0.226393 -0.225162 -0.232741 -0.215071 0.268167 0.270529 0.226355 0.227622 0.228245 0.341261 0.335177
chargesum: 0.00000
title: Mulliken charges with hydrogens summed into heavy atoms:
elementType: S N N N C C C C C C C C
charge: 0.333465 -0.076626 -0.422807 0.126612 0.323325 0.095605 -0.094416 -0.068011 -0.000038 0.002460 -0.004497 -0.215071
polarizability: 2.03127363e+02 -7.11079037e-01 1.27855732e+02 -2.21224220e-03 -2.56393029e-02 4.70614712e+01
1716.lowfreq: -8.8212 -3.6280 -0.0028 -0.0018 -0.0003 7.8361 45.9769 89.4462 126.3552
frequency: 45.9742 89.4451 126.3536 228.4212 259.3319 287.7050 323.2836 357.8012 404.5674 409.7626 465.3766 481.2391 561.2053 563.4604 592.8272 614.7942 636.2585 684.8660 698.3734 701.8056 785.5532 863.0978 869.3984 947.0800 989.2939 993.4800 1003.7774 1004.2165 1030.5586 1078.7574 1137.3360 1172.0372 1182.8198 1256.7294 1295.4891 1328.3556 1381.5113 1396.1269 1443.7789 1492.5387 1570.4621 1589.4020 1614.5368 1631.5806 3126.2240 3138.3426 3153.4961 3165.2477 3172.7524 3550.8151 3699.7228
redmass: 4.6049 6.1522 5.0322 5.7036 7.0084 5.4436 5.3240 1.1875 2.8481 7.4496 1.6680 1.9743 12.3669 4.6638 5.0825 6.5918 7.9194 6.0411 8.4542 1.7330 1.9813 1.2464 8.1091 1.4256 6.0606 1.3793 3.4697 1.3246 1.9216 1.5593 2.9151 1.0552 1.1212 3.6508 2.2847 2.0459 6.1940 5.8300 2.4479 2.8772 2.7271 5.8395 5.0471 1.7452 1.0851 1.0892 1.0940 1.0959 1.0993 1.0456 1.1043
irintensity: 1.7602 5.0592 4.7494 4.0407 0.0003 0.7232 4.5970 31.9630 0.2091 0.3086 170.3727 125.9617 0.4870 8.5754 4.9410 1.4491 21.1042 26.4299 2.9237 68.1406 38.9212 0.0036 3.5580 6.5382 0.2745 0.0424 18.3745 0.8765 9.8800 11.7033 5.9864 0.0386 13.1634 58.5660 50.0378 70.5220 49.9365 62.4769 27.3072 4.2279 136.1413 5.4074 7.5103 379.5993 0.0754 16.1961 25.0638 13.6882 14.7795 117.5980 55.3727
temp: 298.150 k
press: 1.00000 atm
elementType: 16 7 7 7 6 6 6 6 6 6 6 6 1 1 1 1 1 1 1
symmnumber: 1
zpe: 362452.8 jmol-1
zpe.correction: 0.138051 hartree
zpe.thermalcorrener: 0.148190 hartree
zpe.thermalcorrenthalpy: 0.149134 hartree
zpe.thermalcorrgfe: 0.101731 hartree
zpe.sumelectzpe: -870.519909 hartree
zpe.sumelectthermal: -870.509771 hartree
zpe.sumelectthermalent: -870.508827 hartree
zpe.sumelectthermalfe: -870.556229 hartree
dipole: 2.6529 2.8657 0.0083
dipole: 3.9051
quadrupole: -49.2902 -71.3947 -82.1223
quadrupole: 9.6990 0.0162 -0.0190
quadrupole: 18.3122 -3.7923 -14.5199 9.6990 0.0162 -0.0190
hfenergy: -870.6579604 hartree
pointgroup: C01 [X(C8H7N3S1)]
dipole: 1.1020178 1.0690361 -0.0569352 debye
dipolederiv: -0.4851924 0.2433797 -0.0247281 -0.1148948 -0.2663894 0.0255959 -0.0014606 0.0308429 0.1332964 -1.5242745 -0.1963175 -0.0041387 -0.0066508 -0.5938971 0.0261812 -0.0167717 0.0237027 -0.2079804 0.048376 -0.0904755 0.0110842 0.1984883 -0.4791802 0.0146948 -0.0070248 0.0105025 -0.2999797 -1.107557 -0.541341 0.030721 -0.8074554 -0.7003699 -0.0087524 0.0485547 -0.005439 -0.6753385 -0.0435764 -0.0203233 0.0002999 0.0270308 -0.0150557 0.0038607 -0.0039294 0.0034038 0.0351116 1.128143 0.0758734 0.00836 0.2058478 0.4494575 -0.0217921 -0.0008408 -0.0238669 0.0807552 -0.0508175 0.0945038 -0.0057156 -0.0354048 -0.0217584 -0.0091227 0.0038265 -0.0073636 -0.1403515 -0.0332277 -0.0831677 0.0072664 0.0285955 0.0118252 -0.0100431 -0.0004366 -0.0111853 -0.1288013 -0.0952506 -0.1088233 0.0086261 -0.1379697 0.116634 -0.0217269 0.0108834 -0.0213255 -0.1606137 -0.0330248 0.1455014 -0.0089355 0.1960794 0.0344918 -0.0115576 -0.0125038 -0.0120936 -0.1580795 0.0466916 -0.0095081 0.0031832 -0.0266309 -0.0082725 -0.0109496 0.0043587 -0.0108971 -0.1560247 1.6032136 0.4408052 -0.0096075 0.4016152 1.1299136 -0.0657725 -0.0065402 -0.0651858 0.0893538 0.0907727 -0.086477 0.0055047 -0.0892542 0.0231505 0.0085418 0.0057695 0.0084633 0.1559476 0.1300793 0.0660588 -0.0050896 0.0505107 -0.0029414 0.012216 -0.0043171 0.0122515 0.1547403 0.0320592 0.0690142 -0.0065358 0.0987835 -0.1005108 0.0198218 -0.0087109 0.0194174 0.1565276 -0.0228062 -0.0952482 0.0046251 -0.121602 -0.041549 0.0128481 0.006454 0.0132252 0.1564229 -0.1449589 0.0336418 -0.0061902 0.0335064 0.0882355 0.0056508 -0.0061223 0.0056243 0.1603999 0.161172 0.007529 -0.0037185 0.0715986 0.2297008 0.0129439 -0.0081628 0.0120751 0.4070123 0.3001786 0.0553745 -0.005011 0.0278063 0.1465155 0.0173619 -0.0030257 0.0178482 0.3976017 unknown
polarizability: 202.813483|-4.5498918|127.7403481|2.3282768|-5.704745|47.4907346 unknown
InChI: InChI=1S/C8H7N3S/c9-8-10-7(11-12-8)6-4-2-1-3-5-6/h1-5H,9H2
charge 0 multiplicity 1
19 atoms
S  3.005182 -1.426494 0.184654
N  1.556562 0.795584 0.014051
N  1.196967 -1.56754 0.169539
N  3.901482 1.257778 0.014164
C  -0.77167 -0.107651 0.045301
C  0.693252 -0.312149 0.077744
C  -1.298121 1.207141 -0.05572
C  -1.658891 -1.215343 0.114286
C  -2.694356 1.410183 -0.087671
C  -3.052051 -1.006091 0.081927
C  -3.575795 0.306144 -0.019167
C  2.826997 0.412329 0.057073
H  -0.60154 2.049227 -0.107718
H  -1.241516 -2.224132 0.192338
H  -3.09419 2.427342 -0.165713
H  -3.731775 -1.863784 0.135364
H  -4.659832 0.464818 -0.043878
H  3.727888 2.258901 -0.055333
H  4.858104 0.918737 0.049259
