program: Gaussian 09
title: 000028737
version: EM64L-G09RevD.01
frameworkgroup: C1[X(C21H25ClN2O4)]
method: RPBEPBE
basis: SDD
operation: Freq
keyword: #p
keyword: freq=noraman
keyword: PBEPBE/SDD
title: #p freq=noraman PBEPBE/SDD
converged: YES YES NO NO
title: Mulliken charges:
elementType: Cl O O O O N N C C C C C C C C C C C C C C C C C C C C C H H H H H H H H H H H H H H H H H H H H H H H H H
charge: -0.069941 -0.221887 -0.284690 -0.291856 -0.288392 -0.073403 -0.166687 -0.374748 -0.366138 -0.430720 -0.402696 -0.449617 0.533113 0.091240 -0.297920 -0.342630 0.374533 -0.222516 -0.242327 -0.544203 -0.512669 -0.248743 0.241545 0.284359 0.061740 -0.498590 -0.532540 -0.521719 0.182148 0.251485 0.206334 0.195654 0.213559 0.225004 0.217752 0.229532 0.243620 0.208865 0.250602 0.250317 0.225466 0.291223 0.269390 0.231992 0.229591 0.253738 0.204667 0.227936 0.242035 0.235653 0.207003 0.232362 0.272176
chargesum: 0.00000
title: Mulliken charges with hydrogens summed into heavy atoms:
elementType: Cl O O O O N N C C C C C C C C C C C C C C C C C C C C C
charge: -0.069941 -0.221887 -0.284690 -0.291856 -0.288392 -0.073403 -0.166687 0.058885 0.035850 0.007843 0.044588 0.002868 0.533113 0.091240 -0.297920 -0.092028 0.374533 0.027801 -0.016861 -0.252980 -0.243279 -0.016751 0.241545 0.284359 0.061740 0.189406 0.173083 0.189823
polarizability: 4.26882467e+02 2.04414112e+01 2.88303927e+02 -8.43554433e-02 2.77969381e+00 1.46679212e+02
1716.lowfreq: -4.2645 -0.0026 -0.0011 -0.0008 1.7953 5.1061 13.1634 18.2126 23.1540
frequency: 13.1357 18.2028 23.1480 44.9762 50.5097 64.3912 69.9226 74.0588 88.6009 95.2744 98.3185 120.5452 140.5660 149.5572 156.5709 175.3857 182.4789 195.1552 209.3740 217.9618 227.2076 234.9922 258.8442 271.6866 282.3019 295.1937 306.2025 311.9563 322.3411 338.1424 360.6309 374.2414 393.9014 403.5878 432.0936 446.8744 464.6589 470.9116 487.6205 510.0820 526.1722 547.9335 550.5126 578.0963 621.1084 635.6570 651.9968 657.3746 680.5671 710.2284 731.3165 733.7705 750.3736 754.8027 791.5751 840.0293 852.6385 858.3901 861.9249 869.7321 883.1495 924.4234 926.7417 945.5573 947.2109 968.0856 975.4891 992.0270 1006.6747 1017.4267 1041.7661 1053.4764 1055.7792 1066.5905 1071.0844 1095.5661 1106.4035 1108.5160 1112.8248 1119.4001 1133.0891 1138.9243 1151.3876 1155.4535 1159.7617 1162.8846 1171.8035 1183.0842 1203.6966 1210.3867 1225.9247 1230.5807 1239.3102 1268.3202 1279.3464 1301.2211 1304.0140 1335.1638 1342.9359 1356.0305 1361.2462 1370.6529 1377.7379 1383.4762 1386.5617 1405.3150 1417.4104 1428.2407 1437.8934 1440.5055 1443.5726 1452.6434 1453.9327 1455.2556 1457.8426 1462.3192 1466.0344 1467.4632 1470.9729 1471.8165 1480.7301 1481.5985 1483.1578 1558.1518 1561.2990 1593.1270 1602.8637 1606.5896 2805.7917 2855.1691 2870.8794 2915.3857 2924.9846 2970.9168 2972.5025 2978.3255 3008.4492 3028.0715 3056.1843 3063.6655 3081.8365 3087.8361 3090.2118 3098.8042 3127.3338 3128.7152 3132.4126 3132.9112 3150.1807 3160.4067 3168.3285 3171.0226 3174.2923
redmass: 5.9628 5.3649 6.0334 3.0147 4.8559 4.5434 4.2745 4.8059 2.3504 5.5591 2.6660 4.2075 2.5859 3.5230 1.7857 3.2674 1.6013 3.3119 2.7735 2.0859 4.2472 4.1505 2.6508 1.8431 4.4380 2.5019 4.4693 2.9833 3.9384 4.5221 5.0899 5.5185 2.8142 3.7124 5.2848 3.3715 5.9660 3.0859 4.3027 3.8254 5.7630 4.0150 4.6182 4.6627 3.0130 4.0868 4.1935 4.3274 4.2578 3.7159 4.2744 4.5620 1.3375 3.9810 4.0856 1.4211 1.5786 4.2448 1.8066 6.2801 1.4735 3.7515 1.3867 2.4621 8.5054 1.3194 6.5644 2.1925 4.9281 3.1464 2.3002 1.7447 2.4028 2.0154 5.2520 2.2072 1.2478 1.2450 1.2579 1.8174 2.6099 2.8778 1.4065 1.5987 1.5784 1.8901 1.1897 2.6528 1.1136 2.1513 1.4648 1.3415 1.3819 1.5676 1.6218 1.7674 2.1207 1.7210 1.4635 1.7517 1.7800 2.2153 1.6473 3.7209 1.4979 3.3430 1.2511 2.4894 1.1680 1.2331 1.3344 1.1291 1.0988 1.0857 1.0977 1.1988 1.0501 1.4057 1.1585 1.0687 1.4952 2.3971 1.0733 5.9100 7.7650 7.7267 7.5439 6.8506 1.0700 1.0709 1.0691 1.0684 1.0710 1.0328 1.0357 1.0350 1.0838 1.0902 1.0925 1.1044 1.0882 1.0949 1.0964 1.0901 1.1056 1.1008 1.0856 1.1052 1.0893 1.0943 1.0903 1.0918 1.1003
irintensity: 0.6895 0.1063 0.3621 2.9403 0.3425 2.8884 6.8574 0.0455 4.5970 1.7170 1.7395 1.3299 9.8222 2.5720 7.5519 0.2997 2.2884 4.9448 0.0788 2.0143 1.9524 6.1265 2.3120 1.0367 5.2005 1.3295 0.6745 16.6015 3.8346 8.7927 3.1792 1.6010 4.3049 7.4100 8.9708 8.0884 1.3857 1.8537 4.4025 1.4383 2.3207 3.2924 5.5236 4.2571 0.4887 10.7642 1.9924 16.5546 50.8231 2.8888 5.9491 14.5962 88.6316 7.7577 6.5387 0.6408 3.7703 2.4129 14.0518 36.5787 31.3934 34.9840 3.3092 12.4078 65.2077 0.3107 129.4051 2.5960 42.1968 57.1479 18.6551 6.9082 2.1240 0.9747 232.8827 1.5925 7.6949 35.4263 0.3229 7.7596 158.0435 115.7819 63.2536 36.8027 54.4158 1.5917 0.3992 0.2708 3.7895 6.4442 31.6872 76.3162 52.6671 7.2702 141.0600 82.8684 268.1884 64.4273 8.9073 10.3661 17.2283 4.8920 37.6199 41.5367 12.0562 127.2811 6.0792 12.2469 0.2085 18.1370 31.7320 26.5679 3.0324 3.7206 12.4993 156.9768 14.4127 23.0402 23.3530 38.8664 44.3896 98.4114 13.3173 4.1535 259.1386 27.5757 21.4958 87.0030 106.1633 62.3047 84.4821 52.0876 98.7534 68.8321 67.9939 87.8480 22.6038 50.6771 26.3363 36.9324 8.4625 33.9006 48.7489 6.3166 17.6572 24.0995 6.5252 11.8705 10.1558 16.6482 9.1435 0.6859 16.1055
temp: 298.150 k
press: 1.00000 atm
elementType: 17 8 8 8 8 7 7 6 6 6 6 6 6 6 6 6 6 6 6 6 6 6 6 6 6 6 6 6 1 1 1 1 1 1 1 1 1 1 1 1 1 1 1 1 1 1 1 1 1 1 1 1 1
symmnumber: 1
zpe: 1110674.9 jmol-1
zpe.correction: 0.423034 hartree
zpe.thermalcorrener: 0.451070 hartree
zpe.thermalcorrenthalpy: 0.452014 hartree
zpe.thermalcorrgfe: 0.361782 hartree
zpe.sumelectzpe: -1683.521724 hartree
zpe.sumelectthermal: -1683.493687 hartree
zpe.sumelectthermalent: -1683.492743 hartree
zpe.sumelectthermalfe: -1683.582975 hartree
dipole: 4.2940 -1.1343 -2.0093
dipole: 4.8746
quadrupole: -139.9858 -160.5105 -174.5991
quadrupole: 3.4220 -14.9346 0.2164
quadrupole: 18.3793 -2.1454 -16.2340 3.4220 -14.9346 0.2164
hfenergy: -1683.9447572 hartree
pointgroup: C01 [X(C21H25Cl1N2O4)]
dipole: -1.6490766 0.4801929 -0.8532428 debye
polarizability: 426.3041745|19.8292235|288.1851631|14.1424694|3.2893247|147.3762678 unknown
InChI: InChI=1S/C21H25ClN2O4/c1-26-19-12-15(13-20(27-2)21(19)28-3)18(25)14-23-8-10-24(11-9-23)17-7-5-4-6-16(17)22/h4-7,12-13H,8-11,14H2,1-3H3
charge 0 multiplicity 1
53 atoms
Cl 5.876885 -2.611681 0.047735
O  -0.795711 1.744927 0.240642
O  -4.640489 -2.899112 -0.223178
O  -5.915433 1.841481 -0.131221
O  -6.700171 -0.839185 -0.211452
N  1.285577 -0.160308 0.537482
N  4.152674 0.02814 0.233283
C  1.888951 0.582475 -0.596488
C  2.171176 -1.273888 0.96071
C  3.272499 1.132216 -0.208483
C  3.549496 -0.728036 1.362409
C  -0.088839 -0.606737 0.289114
C  5.554469 0.212102 0.187082
C  -1.129005 0.52441 0.19361
C  6.477973 -0.877524 0.141884
C  6.135241 1.5181 0.12833
C  -2.569454 0.132855 0.036216
C  7.870141 -0.695606 0.087911
C  7.528242 1.715238 0.047154
C  -3.53097 1.177447 -0.015502
C  -2.995432 -1.210719 -0.049974
C  8.408977 0.61104 0.041275
C  -4.368002 -1.527258 -0.187879
C  -4.897008 0.873762 -0.132733
C  -5.343281 -0.486895 -0.224262
C  -5.828278 -3.419759 -0.924554
C  -5.513459 3.238604 0.071987
C  -7.581616 -0.261389 -1.251908
H  2.002432 -0.077522 -1.494621
H  1.22949 1.42713 -0.851364
H  1.715729 -1.7799 1.832847
H  2.311479 -2.030656 0.148119
H  3.136302 1.896395 0.591426
H  3.722131 1.621064 -1.090507
H  3.426149 -0.052848 2.239777
H  4.207984 -1.560493 1.651446
H  -0.395688 -1.270481 1.121423
H  -0.182137 -1.224746 -0.645732
H  5.473499 2.388455 0.17158
H  8.524206 -1.572098 0.052224
H  7.925191 2.735658 0.00715
H  -3.162575 2.204014 0.061321
H  -2.296831 -2.051048 -0.029524
H  9.492869 0.753008 -0.011212
H  -5.64037 -4.501534 -1.010041
H  -6.746326 -3.224643 -0.349988
H  -5.919492 -2.975281 -1.934333
H  -4.86753 3.594489 -0.752938
H  -6.454735 3.807316 0.08285
H  -4.98649 3.362413 1.036542
H  -7.247198 -0.583697 -2.257659
H  -8.579263 -0.673011 -1.036786
H  -7.590475 0.837415 -1.18639
