program: Gaussian 09
title: 000002820
version: EM64L-G09RevD.01
frameworkgroup: C1[X(C17H17ClN4)]
method: RPBEPBE
basis: SDD
operation: Freq
keyword: #p
keyword: freq=noraman
keyword: PBEPBE/SDD
title: #p freq=noraman PBEPBE/SDD
converged: YES YES NO NO
title: Mulliken charges:
elementType: Cl N N N N C C C C C C C C C C C C C C C C C H H H H H H H H H H H H H H H H H
charge: -0.076344 -0.193731 -0.297833 -0.503712 -0.070414 -0.374632 -0.374325 -0.409009 -0.412899 0.323252 0.145525 -0.040525 0.362203 0.040825 -0.330410 -0.332946 -0.395291 -0.298955 -0.339548 -0.221910 -0.098604 -0.227868 0.238987 0.272023 0.234603 0.222049 0.195813 0.224642 0.223815 0.198702 0.279501 0.319245 0.238134 0.258301 0.254789 0.225591 0.263449 0.223747 0.253760
chargesum: 0.00000
title: Mulliken charges with hydrogens summed into heavy atoms:
elementType: Cl N N N N C C C C C C C C C C C C C C C C C
charge: -0.076344 -0.193731 -0.018332 -0.184467 -0.070414 0.136377 0.082328 0.011447 0.009618 0.323252 0.145525 -0.040525 0.362203 0.040825 -0.092275 -0.074645 -0.140502 -0.073365 -0.076099 0.001837 -0.098604 0.025892
polarizability: 3.62245574e+02 -2.51748062e+01 2.84374733e+02 -9.57967555e+00 1.18012623e+00 1.20827975e+02
1716.lowfreq: -3.1015 -0.0016 -0.0012 -0.0011 6.2449 7.5088 37.7395 41.6691 64.2392
frequency: 37.6708 41.5607 64.2218 73.5834 91.7455 123.0979 145.4621 186.7475 211.6899 223.0336 243.6682 254.1848 279.9232 297.9952 323.4494 343.9236 353.1061 375.0984 407.6637 437.8264 449.0768 453.6953 455.8434 490.4709 501.6813 526.8969 552.0063 559.6492 568.0157 604.2374 627.5017 649.7277 663.8563 671.6421 693.2246 714.9752 743.0062 753.6023 764.4857 822.8832 829.1358 840.1528 846.2639 849.7838 865.2545 886.7493 919.0230 930.7536 950.3511 951.4109 977.3599 1005.5542 1018.4395 1049.0026 1055.2499 1072.4500 1084.7113 1100.3462 1113.6792 1131.5223 1145.3380 1155.8463 1168.1219 1188.5427 1199.9664 1209.5298 1237.2069 1239.9669 1242.5032 1256.7659 1280.6591 1304.5724 1323.7935 1338.7568 1350.2757 1360.9844 1368.7624 1380.9254 1384.2768 1406.2575 1429.9334 1443.4113 1445.9051 1454.2355 1459.6400 1460.6624 1469.2410 1470.4967 1521.9110 1528.4870 1549.7289 1573.8258 1586.5731 1612.8230 2878.5887 2883.6609 2949.9306 2962.3730 3046.5166 3052.5596 3076.0094 3110.2674 3113.1662 3125.8336 3143.2482 3154.1409 3156.5452 3166.1771 3176.6540 3477.0433 3510.3860
redmass: 6.4156 4.8418 4.6715 3.7975 3.9984 5.8847 6.0282 4.5845 5.7962 4.6682 3.6647 4.0039 3.5242 6.2296 3.0091 3.9531 5.0630 4.8122 2.3777 4.8792 3.3650 2.9900 3.2819 2.0866 1.5021 3.2194 3.2025 4.1444 3.5753 4.8904 5.6996 5.9292 2.9921 2.3272 4.8115 4.0840 4.4790 1.3372 5.2631 1.5831 3.1405 2.0257 1.5525 1.8108 2.2871 3.2189 3.6501 2.5900 1.3510 1.3435 1.3179 2.4234 2.4919 1.7142 1.9054 1.9798 2.4466 2.2261 1.8177 2.5871 2.1086 1.1406 3.3605 2.2436 1.1865 1.6727 1.4388 1.4991 1.5686 1.9228 1.3928 2.7547 1.2416 1.2412 6.4265 1.4369 1.9447 2.1287 1.5564 2.5945 4.6075 2.4764 1.3351 1.0917 1.1290 1.1502 2.5759 1.1075 3.7299 4.3634 9.0282 6.5430 6.0764 6.0848 1.0710 1.0693 1.0665 1.0695 1.0903 1.0909 1.0949 1.0898 1.0900 1.0879 1.0925 1.0942 1.0882 1.0992 1.0972 1.0757 1.0752
irintensity: 0.0701 0.5905 0.1420 0.0226 2.6466 1.6528 0.0382 4.3511 2.0119 0.9880 5.9040 10.2386 0.8521 6.9621 0.6476 4.4878 6.9180 5.5312 9.4557 13.5126 20.6109 5.1249 0.7617 42.6631 110.4159 9.0373 15.1248 19.0055 20.9099 31.1362 3.2300 20.5159 58.5574 24.8792 17.7844 0.0910 7.7283 99.1700 8.8144 40.6547 27.9011 9.0233 5.8417 14.1814 17.1700 26.6301 10.6928 7.8602 7.7553 1.0203 1.9583 18.1698 59.0548 4.7468 20.3555 14.7342 20.2746 16.3010 2.0898 10.3242 25.8742 10.5577 14.0260 53.5714 11.3518 1.1434 15.3542 60.1544 81.0180 28.8461 47.2175 19.3305 36.6103 3.8030 8.9439 58.2141 17.3605 23.4927 4.5322 4.3991 215.1012 76.9929 5.9858 36.8444 23.3643 45.0880 168.8328 7.7194 382.1539 255.4513 404.2010 78.7999 26.6972 166.5404 47.4265 104.7407 57.7515 64.7679 42.0229 49.0698 16.6752 3.0450 5.6616 17.8606 3.1945 23.5083 2.8077 31.3014 5.9557 0.0325 18.1778
temp: 298.150 k
press: 1.00000 atm
elementType: 17 7 7 7 7 6 6 6 6 6 6 6 6 6 6 6 6 6 6 6 6 6 1 1 1 1 1 1 1 1 1 1 1 1 1 1 1 1 1
symmnumber: 1
zpe: 812218.6 jmol-1
zpe.correction: 0.309358 hartree
zpe.thermalcorrener: 0.327568 hartree
zpe.thermalcorrenthalpy: 0.328513 hartree
zpe.thermalcorrgfe: 0.262956 hartree
zpe.sumelectzpe: -1335.459767 hartree
zpe.sumelectthermal: -1335.441556 hartree
zpe.sumelectthermalent: -1335.440612 hartree
zpe.sumelectthermalfe: -1335.506169 hartree
dipole: -6.1111 -4.4680 0.0667
dipole: 7.5706
quadrupole: -130.2475 -129.8211 -139.0805
quadrupole: 10.0517 -4.8543 0.6673
quadrupole: 2.8022 3.2286 -6.0308 10.0517 -4.8543 0.6673
hfenergy: -1335.7691246 hartree
pointgroup: C01 [X(C17H17Cl1N4)]
dipole: -2.5850298 1.4795022 -0.0114921 debye
polarizability: 354.1678284|29.916288|284.8643094|-23.4283141|-33.0389147|128.4161441 unknown
InChI: InChI=1S/C17H17ClN4/c18-12-5-6-15-16(11-12)21-17(22-9-7-19-8-10-22)13-3-1-2-4-14(13)20-15/h1-6,11,19,21H,7-10H2
charge 0 multiplicity 1
39 atoms
Cl 5.039428 2.483626 -1.627296
N  -1.848928 1.134226 0.259931
N  -4.251109 2.632339 -0.09299
N  0.47791 0.961179 0.415305
N  1.516013 -1.857594 0.759093
C  -3.082539 0.783867 1.017129
C  -1.787891 2.570504 -0.116152
C  -4.342187 1.19286 0.232061
C  -3.061214 2.94914 -0.906236
C  -0.722954 0.306373 0.213108
C  -0.830446 -1.10413 0.041303
C  0.193896 -2.038198 0.57997
C  1.787228 0.538989 -0.033673
C  2.252047 -0.788628 0.219596
C  -2.053756 -1.654904 -0.503393
C  -0.304576 -3.367364 0.914226
C  2.62323 1.521662 -0.603832
C  -2.399148 -2.987213 -0.323321
C  3.614592 -1.062103 -0.104378
C  -1.533373 -3.830376 0.466589
C  3.95829 1.194037 -0.914627
C  4.471013 -0.091584 -0.664867
H  -3.070881 1.347852 1.973696
H  -3.083984 -0.293049 1.236338
H  -0.897257 2.744367 -0.743087
H  -1.733228 3.213675 0.78853
H  -4.426016 0.545385 -0.675071
H  -5.232306 1.018675 0.86244
H  -3.041715 4.033632 -1.117277
H  -3.037919 2.402767 -1.881019
H  -5.120676 3.019209 -0.477476
H  0.445375 1.842492 0.933552
H  -2.706973 -0.986246 -1.078209
H  0.395804 -4.019805 1.445406
H  2.242441 2.531697 -0.789223
H  -3.313668 -3.395175 -0.765666
H  3.981641 -2.068682 0.11612
H  -1.832471 -4.864273 0.676722
H  5.513905 -0.32983 -0.892623
