program: Gaussian 09
title: 000028532
version: EM64L-G09RevD.01
frameworkgroup: C1[X(C7H5N3O2)]
method: RPBEPBE
basis: SDD
operation: Freq
keyword: #pfreq=noraman
keyword: PBEPBE/SDD
title: #p freq=noraman PBEPBE/SDD
converged: YES YES YES YES
title: Mulliken charges:
elementType: O O N N N C C C C C C C H H H H H
charge: -0.216679 -0.213901 0.017222 -0.657251 -0.016572 0.411880 0.314577 0.309296 -0.497617 -0.353028 -0.354211 -0.267081 0.309493 0.290904 0.239106 0.328622 0.355242
chargesum: 0.00000
title: Mulliken charges with hydrogens summed into heavy atoms:
elementType: O O N N N C C C C C C C
charge: -0.216679 -0.213901 0.017222 0.026613 -0.016572 0.411880 0.314577 0.309296 -0.188124 -0.062124 -0.115105 -0.267081
polarizability: 1.80579736e+02 2.75614830e+00 1.21269386e+02 -4.44366738e-03 -1.65403907e-03 3.96182641e+01
1716.lowfreq: 0.0002 0.0005 0.0007 4.8655 4.8831 10.0986 63.7865 108.0867 117.9666
frequency: 63.7842 108.0846 117.9666 141.9971 213.0474 287.8724 348.2004 359.9556 397.9880 453.4296 462.2673 488.3308 509.4850 552.9471 575.6704 583.4661 635.9946 694.3835 728.1992 757.2519 785.5216 839.5794 898.3245 952.5883 988.8828 1026.8766 1080.6185 1153.2436 1182.4194 1219.9740 1272.4195 1334.3237 1357.2583 1413.5178 1446.3850 1502.6567 1576.2495 1620.8311 1651.4887 2167.3786 3146.7938 3184.0684 3185.6599 3530.2215 3674.5083
redmass: 14.1818 5.5683 11.5563 5.7591 6.5411 6.6106 9.4764 4.8938 4.0035 6.7052 1.1208 2.5530 8.8529 1.3029 5.6501 5.0665 8.1343 7.0489 9.4499 3.6867 5.7695 1.6149 6.1154 1.4429 1.3405 1.6067 2.0003 1.3922 3.3418 7.1568 1.4805 2.3606 10.3817 7.9962 5.4537 3.5025 7.5411 4.3377 1.3272 12.6150 1.0903 1.0938 1.0949 1.0469 1.1031
irintensity: 1.2059 0.0005 7.1068 1.4682 0.0261 4.1627 0.3186 2.5216 0.0263 3.0611 42.7871 27.9170 1.6280 235.9815 3.9216 1.4103 9.9965 17.3450 14.7274 0.9859 0.3684 47.1342 5.1830 22.5644 0.2912 0.6854 20.5545 57.3914 8.0043 518.1162 29.3988 39.0703 83.4532 32.0488 13.1537 44.7810 36.5947 105.8588 312.5722 44.5733 8.2326 1.4574 7.5884 145.9773 42.3446
temp: 298.150 k
press: 1.00000 atm
elementType: 8 8 7 7 7 6 6 6 6 6 6 6 1 1 1 1 1
symmnumber: 1
zpe: 303086.5 jmol-1
zpe.correction: 0.115440 hartree
zpe.thermalcorrener: 0.125562 hartree
zpe.thermalcorrenthalpy: 0.126506 hartree
zpe.thermalcorrgfe: 0.079413 hartree
zpe.sumelectzpe: -583.522948 hartree
zpe.sumelectthermal: -583.512826 hartree
zpe.sumelectthermalent: -583.511881 hartree
zpe.sumelectthermalfe: -583.558974 hartree
dipole: -4.7345 5.6294 0.0001
dipole: 7.3557
quadrupole: -83.2165 -65.7433 -69.8747
quadrupole: -12.1737 0.0026 0.0008
quadrupole: -10.2717 7.2015 3.0701 -12.1737 0.0026 0.0008
hfenergy: -583.6383874 hartree
pointgroup: C01 [X(C7H5N3O2)]
dipole: -1.7415392 2.3112581 0.0000296 debye
dipolederiv: -1.0250452 -0.1334221 0.0000046 -0.2798585 -0.4985913 -0.0000189 0.0001244 0.0000426 -0.2381116 -0.6116781 0.153478 0.000016 0.4082719 -0.8521716 0.0000535 0.0000657 -0.000074 -0.2356194 2.125141 -0.2762184 -0.0000635 -0.4256247 1.1464999 -0.0000247 -0.0001401 0.0000175 0.1883864 -1.4006656 0.6446742 -0.0000002 0.4883917 -0.3624645 0.0000121 -0.0000192 0.0000131 -0.653183 -0.397522 -0.1567004 -0.000079 -0.0943425 -0.3132319 -0.0000693 -0.0000066 0.0000028 -0.2386217 -1.0635556 0.1786125 0.0000407 0.1883711 -0.4036846 -0.0000033 0.0000021 0.0000006 0.0167338 1.3717656 -0.71261 0.0000099 -0.4399478 0.3769154 -0.0000038 -0.0000084 -0.0000188 0.1550396 -0.4698988 -0.164767 0.0000185 0.480819 -0.1892936 0.0000002 -0.0000116 -0.0000107 0.0481449 0.7330847 0.0985896 -0.0000051 0.0646817 -0.0297201 -0.0000039 -0.0000487 -0.0000074 -0.0642333 0.270402 -0.2447524 0.0000032 -0.3338824 0.3332882 0.0000084 -0.0000233 0.0000008 -0.0702768 -0.646278 0.3319437 0.0000016 -0.2315667 0.1733768 0.0000037 -0.0000085 0.0000188 -0.1971727 0.3333734 0.3769844 0.0000585 0.262707 0.1625746 0.0000599 0.0000502 0.0000261 0.0202239 0.136575 0.0220904 -0.0000038 -0.0173216 0.0693527 0.0000005 0.000008 -0.0000014 0.1737933 0.0829697 -0.0675847 -0.0000042 -0.0175185 0.0987206 -0.0000031 -0.0000018 -0.0000005 0.1661139 0.0461567 0.0631873 0.0000027 0.0308274 -0.0763584 -0.0000031 0.0000111 -0.0000061 0.168951 0.2205288 -0.0572767 -0.0000023 -0.1222371 0.2097666 -0.0000023 -0.0000019 0.0000008 0.3808338 0.2946464 -0.0562284 0.0000025 0.0382302 0.1550213 -0.000006 0.0000086 -0.0000043 0.378998 unknown
polarizability: 180.7044602|-0.4282353|121.1446619|-0.0045258|-0.0014139|39.6182641 unknown
InChI: InChI=1S/C7H5N3O2/c8-4-5-3-6(10(11)12)1-2-7(5)9/h1-3H,9H2
charge 0 multiplicity 1
17 atoms
O  3.556171 0.402608 -0.000096
O  2.750398 -1.736131 -0.000014
N  2.58412 -0.452673 0.000123
N  -2.720907 1.575823 0.000062
N  -3.294926 -1.913498 0.00031
C  1.209441 0.068682 0.000107
C  -1.433606 1.087729 0.00008
C  -1.189348 -0.335653 0.00006
C  0.1312 -0.834974 0.000077
C  0.996155 1.471299 0.000118
C  -0.30921 1.970665 0.000108
C  -2.316424 -1.223297 0.00002
H  0.32649 -1.910342 0.000072
H  1.862281 2.13828 0.000136
H  -0.479601 3.052619 0.000126
H  -2.898202 2.577257 0.000069
H  -3.521133 0.943707 0.00004
