program: Gaussian 09
title: 000028541
version: EM64L-G09RevD.01
frameworkgroup: C1[X(C8H16O2)]
method: RPBEPBE
basis: SDD
operation: Freq
keyword: #pfreq=noraman
keyword: PBEPBE/SDD
title: #p freq=noraman PBEPBE/SDD
converged: YES YES NO NO
title: Mulliken charges:
elementType: O O C C C C C C C C H H H H H H H H H H H H H H H H
charge: -0.266743 -0.205568 -0.172968 -0.527053 -0.380023 0.220781 -0.265201 -0.692039 -0.688262 -0.499050 0.211185 0.232263 0.228757 0.242604 0.226286 0.180204 0.179971 0.242588 0.216490 0.209824 0.214100 0.236427 0.224201 0.197806 0.234739 0.198681
chargesum: 0.00000
title: Mulliken charges with hydrogens summed into heavy atoms:
elementType: O O C C C C C C C C
charge: -0.266743 -0.205568 0.038217 -0.066033 0.088867 0.220781 0.094974 -0.023137 -0.013535 0.132177
polarizability: 1.17871121e+02 -2.29412767e-01 8.38346437e+01 -1.12162976e-01 2.69466508e+00 7.86407284e+01
1716.lowfreq: -25.3779 -2.6211 -0.0007 -0.0007 -0.0005 2.5177 20.2440 35.0897 52.8649
frequency: 10.7463 34.7454 52.8049 78.6656 108.8517 116.7609 187.1345 197.6481 216.9197 224.1737 233.3139 249.9737 293.9105 367.0205 407.7041 485.2884 558.4651 631.6732 760.9367 788.6464 861.3006 873.6575 901.4105 921.5272 960.4081 1014.2917 1044.4264 1059.1226 1082.6513 1094.6945 1100.2547 1110.1304 1119.7270 1158.7646 1165.4950 1177.3081 1251.6470 1260.3990 1274.2141 1289.9763 1328.8400 1350.8080 1373.7832 1386.7565 1392.5572 1431.3279 1439.3525 1457.6555 1462.8504 1466.0560 1469.3787 1473.6159 1478.0502 1489.4449 1490.2649 1632.9381 2893.9336 2920.8355 2938.8710 2945.5914 2978.9458 2983.1953 2988.2973 2990.4538 2994.3983 3021.0074 3074.4645 3081.4010 3084.9280 3087.1108 3095.8884 3101.6745
redmass: 3.6616 1.9427 3.2459 3.6566 2.6242 1.8600 1.0701 2.2249 2.7964 1.2914 1.7201 2.1327 3.2832 2.8032 3.1164 3.1270 2.1506 3.0486 1.2349 3.5241 1.4487 3.2765 3.7534 1.1529 1.3856 3.2938 1.7426 4.3218 2.2410 1.7614 2.6669 1.5766 1.7287 1.5272 1.2686 1.8907 1.2356 1.3524 1.1199 1.3178 1.5129 1.7277 1.1978 1.4327 1.2068 1.0948 1.1631 1.0513 1.0442 1.0679 1.0501 1.0719 1.0496 1.0584 1.0809 7.9726 1.0534 1.0353 1.1057 1.0624 1.0368 1.0625 1.0531 1.1024 1.0947 1.0608 1.1000 1.0998 1.1029 1.1011 1.0997 1.0967
irintensity: 0.5339 3.5106 1.3990 0.4644 4.3498 1.0684 0.0647 0.7734 0.6566 3.9803 2.1770 1.9282 11.7384 4.5956 3.7846 6.1346 0.5471 1.6237 6.5095 8.1075 1.1960 6.0187 12.7827 4.5671 1.5246 57.8086 3.2576 46.7585 15.0510 52.7663 49.5920 9.5056 1.5412 1.4782 1.8412 2.6925 5.4854 36.4377 1.5753 7.2945 5.2049 40.1784 15.2450 16.2991 28.1111 16.9385 0.8101 12.1493 6.0254 12.9352 3.6753 7.2972 17.8540 22.7734 6.8250 83.7158 57.6372 103.9375 72.5223 23.8393 27.9553 33.7151 22.4466 78.1826 15.6571 13.9160 29.6613 43.1742 31.5384 11.7236 35.3834 32.6182
temp: 298.150 k
press: 1.00000 atm
elementType: 8 8 6 6 6 6 6 6 6 6 1 1 1 1 1 1 1 1 1 1 1 1 1 1 1 1
symmnumber: 1
zpe: 592339.7 jmol-1
zpe.correction: 0.225610 hartree
zpe.thermalcorrener: 0.238963 hartree
zpe.thermalcorrenthalpy: 0.239907 hartree
zpe.thermalcorrgfe: 0.183289 hartree
zpe.sumelectzpe: -464.040046 hartree
zpe.sumelectthermal: -464.026693 hartree
zpe.sumelectthermalent: -464.025749 hartree
zpe.sumelectthermalfe: -464.082367 hartree
dipole: 0.0855 3.4594 2.8096
dipole: 4.4574
quadrupole: -55.0812 -65.9715 -63.5321
quadrupole: -0.1621 2.3415 -3.0485
quadrupole: 6.4471 -4.4433 -2.0038 -0.1621 2.3415 -3.0485
hfenergy: -464.2656562 hartree
pointgroup: C01 [X(C8H16O2)]
dipole: -0.0235014 1.4989933 -0.9098533 debye
dipolederiv: -1.1755191 0.0224961 0.0099102 -0.0499842 -0.4103845 -0.0204911 0.0807155 -0.0235962 -0.4201029 -0.6782264 -0.0085264 0.0000577 0.0086732 -0.7260197 0.1777342 0.0086408 0.2253996 -0.3772832 -0.3201872 -0.1520593 0.0067841 -0.1551662 -0.0258475 -0.0358114 -0.0612142 -0.0785937 0.107563 -0.3871198 0.1420521 -0.0939654 0.2790657 -0.029442 0.1383995 -0.2282187 0.1598338 0.0706909 -0.0938693 0.0052045 0.0053954 0.0348646 0.0548179 0.0411257 -0.0049844 0.0306602 0.0936306 1.2126056 0.038131 0.0973185 -0.0238992 0.7194294 -0.2991143 0.0764728 -0.3510309 0.1861334 0.7244861 0.0939922 -0.0909032 0.191207 0.4017024 0.0558895 -0.1870309 0.0651836 0.4227124 -0.0003455 0.0620031 0.0117278 -0.019209 -0.0015178 -0.0021431 0.0283003 -0.0152101 0.0344653 0.0208215 -0.022708 -0.0033429 0.0012546 0.0474511 -0.0471505 0.0975679 0.0211278 0.0117397 0.6533502 -0.0808289 0.0627315 -0.2140736 0.3367089 0.0490109 0.1809057 0.043497 0.3326752 0.0210197 0.0585052 -0.056456 0.0721104 -0.0494079 0.0915239 -0.0435565 0.095281 -0.0784887 0.0498428 -0.0309556 -0.0125108 -0.0869901 -0.1114327 -0.0302737 0.0367457 -0.0676048 0.0835583 0.0577732 0.0189989 0.0030992 -0.0272078 0.0920803 -0.011195 0.0553974 0.0158561 -0.113951 0.0881367 0.0026571 0.0029151 -0.0171464 -0.0864803 -0.0367323 0.002297 -0.0381214 0.0723033 0.0635954 -0.0068165 -0.0122893 -0.0016984 0.0765253 -0.0189385 -0.0063131 -0.0125652 -0.1229767 -0.0359755 -0.0181946 -0.0204981 -0.0366889 0.0313249 -0.0287583 0.0502238 0.0063511 -0.2505884 -0.0379705 0.003717 0.0218753 -0.0635396 -0.243106 -0.0185705 0.0359818 -0.0597496 0.0230686 0.1114198 0.0137191 -0.0011798 0.0629173 0.004465 0.0707397 -0.0541657 0.1131679 -0.0089822 0.0694044 -0.0216736 -0.071651 0.0064931 0.0246671 -0.112035 -0.0251225 -0.1161334 -0.1036857 -0.1481535 -0.0798751 0.0548036 -0.1145966 0.0194436 0.0183861 0.0391847 0.0038275 0.0927691 -0.0301298 0.1443875 0.0678378 0.1209794 -0.0203284 -0.0771148 0.0501491 -0.0536799 0.039039 0.0827706 0.0032091 -0.0414288 0.0449903 -0.0050517 0.1245635 -0.0516189 0.0569454 -0.0329064 -0.1104722 -0.1387845 0.017017 -0.1231321 0.0205955 0.006413 0.0209485 0.0081498 0.0618606 -0.0127782 -0.0031096 -0.017603 0.1460758 -0.2250355 -0.0646718 -0.0419295 -0.059512 0.0529678 -0.1073196 -0.0638937 0.0682619 -0.0920033 0.0459114 0.0649565 0.0944963 0.0635595 0.0497135 -0.0171594 0.0183528 -0.0079069 0.056704 0.0589313 -0.0357422 -0.1538728 -0.0330432 -0.2259255 unknown
polarizability: 117.8694596|-0.1283493|84.463409|-0.3611348|-1.893321|78.0136247 unknown
InChI: InChI=1S/C8H16O2/c1-7(2)8(9)5-4-6-10-3/h7H,4-6H2,1-3H3
charge 0 multiplicity 1
26 atoms
O  -3.626614 -0.242121 0.358562
O  1.369779 -1.411839 0.57908
C  2.657502 0.444183 -0.356512
C  0.046146 0.405832 -0.383878
C  -1.213908 -0.234454 0.225639
C  1.353351 -0.296642 -0.006195
C  -2.495341 0.419648 -0.297595
C  3.756838 -0.535549 -0.822113
C  3.111413 1.237809 0.905094
C  -4.91208 0.297783 -0.074857
H  2.437653 1.175156 -1.160765
H  0.133096 1.477946 -0.108023
H  -0.009407 0.398221 -1.495603
H  -1.231705 -1.314543 -0.002404
H  -1.187209 -0.150666 1.327291
H  -2.573882 0.302335 -1.404271
H  -2.509037 1.511492 -0.069098
H  3.919702 -1.312384 -0.055159
H  3.474328 -1.044222 -1.761612
H  4.707577 0.001621 -0.991985
H  2.335769 1.945853 1.251694
H  3.336417 0.539856 1.731184
H  4.025071 1.816414 0.678786
H  -5.003744 1.379803 0.164217
H  -5.685501 -0.2629 0.473317
H  -5.065513 0.162267 -1.167695
