program: Gaussian 09
title: 000028554
version: EM64L-G09RevD.01
frameworkgroup: C1[X(C14H21ClN2O2)]
method: RPBEPBE
basis: SDD
operation: Freq
keyword: #p
keyword: freq=noraman
keyword: PBEPBE/SDD
title: #p freq=noraman PBEPBE/SDD
converged: YES YES NO NO
title: Mulliken charges:
elementType: Cl O O N N C C C C C C C C C C C C C C H H H H H H H H H H H H H H H H H H H H H
charge: -0.059082 -0.317474 -0.268026 -0.106197 -0.340804 -0.340298 -0.334291 -0.326722 -0.396237 -0.670489 -0.672485 0.148336 -0.386502 0.407238 -0.322575 -0.365219 -0.206877 -0.182765 -0.119003 0.228487 0.197021 0.226785 0.191749 0.206774 0.188895 0.237218 0.244344 0.205395 0.225824 0.208637 0.204429 0.228310 0.208074 0.342214 0.246666 0.245331 0.258707 0.250619 0.256024 0.257969
chargesum: 0.00000
title: Mulliken charges with hydrogens summed into heavy atoms:
elementType: Cl O O N N C C C C C C C C C C C C C C
charge: -0.059082 -0.317474 -0.268026 -0.106197 0.001410 0.085209 0.084243 0.068947 0.085325 -0.030633 -0.031673 0.148336 0.105495 0.407238 -0.063868 -0.114600 0.049147 0.075204 -0.119003
polarizability: 2.65631418e+02 -1.09822172e+01 1.78117183e+02 7.79466497e+00 1.42870977e+01 1.13732636e+02
1716.lowfreq: -4.6430 -0.6148 0.0004 0.0010 0.0014 5.5835 10.3414 21.1304 25.3656
frequency: 9.2811 20.9287 24.9954 48.1200 49.4572 58.1498 74.7817 80.9241 90.5416 126.6821 139.5147 153.6996 183.8410 210.8785 239.8681 257.7577 264.8831 283.9637 299.7914 316.1712 320.2455 377.7483 399.2358 414.8768 420.2430 448.1103 476.0053 497.1015 511.1075 592.9185 620.2274 625.3615 663.1672 676.8705 695.2464 749.9800 769.2733 794.8531 798.0602 804.5829 809.5902 821.6456 878.0632 917.5943 929.9276 950.3066 984.4577 990.0743 991.3256 1003.6235 1033.5027 1070.1633 1072.1586 1073.5430 1077.6849 1084.6478 1092.0285 1109.6827 1126.9213 1174.4968 1180.0058 1203.7012 1208.1421 1217.7460 1242.9057 1262.2680 1282.2498 1290.4913 1291.4960 1303.1946 1330.4032 1339.1940 1362.8137 1370.3916 1374.7857 1379.4235 1386.1922 1387.1447 1404.0993 1446.8052 1450.0372 1462.8264 1464.3181 1472.2005 1475.6560 1479.8511 1485.0356 1487.8567 1491.2922 1508.8995 1587.1040 1604.8758 1625.9390 2854.4174 2867.0365 2902.7779 2981.3635 2982.3754 2983.0232 3025.3102 3028.2444 3033.2236 3035.0127 3047.3628 3073.2028 3075.7699 3090.9673 3091.3484 3093.4510 3158.0092 3158.7433 3176.0455 3179.8605 3530.9029
redmass: 5.1483 5.0809 3.7969 5.2898 4.9749 4.2235 2.8904 3.0569 2.0338 7.2046 3.8078 2.6307 1.5800 1.2695 4.2800 2.8270 1.9881 2.8243 2.5848 6.2994 4.5259 3.4313 3.0748 2.9915 9.4261 2.8968 3.2524 2.7168 3.9111 3.7299 5.5736 6.4801 1.1966 3.3764 3.5029 2.5922 1.3453 1.1981 1.1666 1.2681 6.4520 1.5706 2.7838 1.9872 1.3411 1.3490 6.8534 2.2740 3.9806 1.8271 3.8967 1.8521 2.6316 2.6735 1.9611 2.1568 3.8244 1.3023 1.7931 1.2154 1.7955 1.0803 2.2441 3.8287 1.7422 1.6422 1.1482 1.2690 1.2328 1.1543 1.2986 1.4547 1.3269 1.3224 4.5226 1.3645 1.2431 1.2394 3.6750 1.1066 1.1359 1.0537 1.0552 1.0545 2.1003 1.0461 1.0750 1.0815 1.0823 2.0624 7.4497 6.6253 8.1129 1.0720 1.0713 1.0695 1.0357 1.0554 1.0356 1.0603 1.0866 1.0881 1.0904 1.1065 1.0983 1.0981 1.1004 1.1003 1.1054 1.0881 1.0886 1.0968 1.0978 1.0775
irintensity: 0.0420 0.1866 0.0325 4.8951 0.7531 1.3982 0.1803 1.6433 0.5000 0.7400 0.8672 14.9374 3.0056 0.2107 0.5153 1.3343 4.5732 0.4609 3.6159 1.1121 5.8794 6.3864 9.2000 0.1318 9.0837 5.6481 4.9159 23.0348 24.8640 12.5882 10.2523 15.1750 102.6896 27.3862 1.3116 4.4362 7.1064 3.8232 7.3926 8.1335 7.1321 87.5791 3.1684 0.9290 0.0966 0.1042 98.1119 4.1044 32.8159 1.0497 3.4138 29.8600 18.1399 39.8165 32.4211 3.7161 2.1861 15.1101 12.5406 62.1521 28.4302 5.5531 64.6370 266.8679 11.7383 18.0016 7.3035 0.5841 21.2469 6.7398 3.2557 1.7111 3.0631 5.0691 8.0871 0.9668 25.1663 22.0981 1.5068 40.0378 120.1050 7.8339 1.9262 5.5093 196.4978 3.6522 13.3563 19.1468 14.9219 220.1281 7.8748 23.2246 224.5942 58.0379 127.9073 83.0133 31.9358 19.5869 32.3297 33.5755 3.8967 16.5421 27.5726 15.6479 49.7182 70.1883 30.5621 56.5333 14.4478 9.3445 0.5867 5.9323 1.0506 60.9953
temp: 298.150 k
press: 1.00000 atm
elementType: 17 8 8 7 7 6 6 6 6 6 6 6 6 6 6 6 6 6 6 1 1 1 1 1 1 1 1 1 1 1 1 1 1 1 1 1 1 1 1 1
symmnumber: 1
zpe: 867344.5 jmol-1
zpe.correction: 0.330354 hartree
zpe.thermalcorrener: 0.351378 hartree
zpe.thermalcorrenthalpy: 0.352322 hartree
zpe.thermalcorrgfe: 0.275899 hartree
zpe.sumelectzpe: -1264.615687 hartree
zpe.sumelectthermal: -1264.594663 hartree
zpe.sumelectthermalent: -1264.593719 hartree
zpe.sumelectthermalfe: -1264.670141 hartree
dipole: 0.9563 2.0383 -0.1341
dipole: 2.2555
quadrupole: -133.0828 -122.3001 -123.2561
quadrupole: 10.9084 -2.3820 2.1428
quadrupole: -6.8698 3.9129 2.9569 10.9084 -2.3820 2.1428
hfenergy: -1264.946041 hartree
pointgroup: C01 [X(C14H21Cl1N2O2)]
dipole: -0.4559056 0.1786 -0.7400682 debye
polarizability: 262.8380726|7.3480181|110.6860233|-18.5011304|3.4510385|183.957142 unknown
InChI: InChI=1S/C14H21ClN2O2/c1-3-17(4-2)10-9-16-14(18)11-19-13-7-5-12(15)6-8-13/h5-8,16H,3-4,9-11H2,1-2H3
charge 0 multiplicity 1
40 atoms
Cl 7.327746 0.316478 -1.569287
O  1.52679 -0.216021 -0.009775
O  -1.010754 -0.100557 2.598135
N  -4.745154 0.396009 -0.019309
N  -1.069027 -0.53083 0.297045
C  -3.280173 0.606033 -0.078011
C  -5.280383 0.496565 1.368127
C  -5.509114 1.20933 -1.001472
C  -2.527076 -0.715781 0.22469
C  -6.550175 -0.348567 1.583645
C  -5.376228 0.688667 -2.445347
C  -0.434239 -0.225861 1.473236
C  1.086851 -0.044041 1.383328
C  2.897807 -0.079125 -0.293062
C  3.884356 0.210276 0.680874
C  3.259938 -0.250173 -1.651796
C  5.23783 0.329655 0.288076
C  4.607631 -0.131147 -2.042324
C  5.581832 0.159004 -1.063998
H  -2.933553 1.385687 0.641012
H  -3.001812 0.954415 -1.089679
H  -4.494872 0.143803 2.061569
H  -5.482072 1.562127 1.644289
H  -6.574721 1.166869 -0.711298
H  -5.213763 2.288765 -0.959162
H  -2.767796 -1.460401 -0.553768
H  -2.861721 -1.114365 1.19771
H  -7.376009 -0.029045 0.921938
H  -6.33924 -1.411494 1.37317
H  -6.902661 -0.256175 2.627986
H  -4.32969 0.719224 -2.800528
H  -5.725426 -0.356881 -2.504674
H  -5.980399 1.305616 -3.136652
H  -0.489251 -0.590152 -0.544043
H  1.567666 -0.794426 2.040838
H  1.339707 0.969542 1.75058
H  3.625632 0.344392 1.734767
H  2.482185 -0.474326 -2.387679
H  6.007857 0.552813 1.032049
H  4.894782 -0.2617 -3.089402
