program: Gaussian 09
title: 000028518
version: EM64L-G09RevD.01
frameworkgroup: C1[X(C9H14N2)]
method: RPBEPBE
basis: SDD
operation: Freq
keyword: #pfreq=noraman
keyword: PBEPBE/SDD
title: #p freq=noraman PBEPBE/SDD
converged: YES YES NO NO
title: Mulliken charges:
elementType: N N C C C C C C C C C H H H H H H H H H H H H H H
charge: -0.021638 -0.035965 0.106683 -0.488859 0.065228 0.095136 0.083667 -0.684059 -0.794758 -0.777480 -0.773779 0.206944 0.230036 0.237703 0.221732 0.211068 0.226654 0.255727 0.232280 0.224736 0.224008 0.253077 0.253439 0.224182 0.224238
chargesum: 0.00000
title: Mulliken charges with hydrogens summed into heavy atoms:
elementType: N N C C C C C C C C C
charge: -0.021638 -0.035965 0.106683 -0.051878 0.065228 0.095136 0.083667 -0.013555 -0.080097 -0.075659 -0.071920
polarizability: 1.49179746e+02 -4.90212917e+00 1.12802523e+02 4.19839033e+00 1.66878872e+00 7.11746697e+01
1716.lowfreq: -16.2901 -10.9193 -7.7280 -0.0005 0.0002 0.0007 46.5343 54.5918 62.2854
frequency: 45.2881 53.6324 62.2097 110.5653 132.1892 141.7686 209.1552 218.3247 273.1753 283.6967 299.7064 310.4367 402.0240 461.5417 486.4659 507.7759 524.1905 630.5047 667.2116 687.7170 767.1003 784.4724 807.8960 951.2046 958.7077 989.6827 1016.4014 1019.4811 1040.1156 1054.0858 1060.8161 1073.5705 1128.7545 1180.4872 1234.2737 1272.9112 1284.3883 1313.3970 1363.5369 1382.4678 1389.5920 1394.7258 1403.2148 1405.2897 1443.9782 1458.9197 1459.6971 1463.4182 1469.4333 1470.3970 1471.9071 1475.6520 1486.7325 1524.6099 1527.0988 2974.7901 2975.7592 2980.3365 2981.7327 3006.5549 3047.3696 3050.3689 3057.1553 3060.7491 3080.3189 3092.3463 3112.4527 3112.8343 3113.5730
redmass: 1.8402 1.2352 2.8787 1.1059 1.1116 2.1522 1.1197 3.3110 2.4172 3.2086 2.6975 1.9954 3.8642 5.4471 5.0345 2.5346 4.2933 3.6502 3.6886 7.7675 1.6764 3.6296 1.9156 1.7378 2.0048 1.6393 1.4239 1.7674 1.5694 1.7971 2.0232 1.7751 3.0563 3.2611 2.4115 2.0623 3.2634 1.6243 1.7292 1.2583 1.2565 1.2338 3.0133 2.7813 1.1940 1.0534 1.1737 1.1237 1.0572 1.0482 1.0851 1.0491 1.0804 5.4041 4.6810 1.0380 1.0391 1.0385 1.0348 1.0600 1.0968 1.0968 1.0966 1.1006 1.1002 1.1018 1.0982 1.0979 1.0976
irintensity: 0.0520 0.0700 0.0669 2.7394 0.9541 1.2470 0.2812 3.2580 0.4899 1.0641 2.7380 0.7441 1.0701 1.7350 1.6702 0.1259 0.2511 1.1162 2.2704 0.2021 9.8905 0.5662 1.3661 5.7214 19.6869 6.2025 11.7648 16.2300 2.9414 4.2694 8.7184 2.1932 0.6811 10.4857 1.4133 1.5978 0.2645 1.1207 5.7097 13.2235 6.4305 11.2209 77.2239 92.7462 6.1549 1.0293 18.5745 23.0367 9.9578 48.2294 8.0447 14.2937 17.3028 1.0118 0.6377 47.7786 4.1608 15.9467 38.2904 28.6818 40.0214 0.0206 18.7887 2.3923 53.8971 37.8743 4.2495 27.1741 0.8059
temp: 298.150 k
press: 1.00000 atm
elementType: 7 7 6 6 6 6 6 6 6 6 6 1 1 1 1 1 1 1 1 1 1 1 1 1 1
symmnumber: 1
zpe: 554363.5 jmol-1
zpe.correction: 0.211146 hartree
zpe.thermalcorrener: 0.223676 hartree
zpe.thermalcorrenthalpy: 0.224620 hartree
zpe.thermalcorrgfe: 0.171963 hartree
zpe.sumelectzpe: -460.025680 hartree
zpe.sumelectthermal: -460.013150 hartree
zpe.sumelectthermalent: -460.012206 hartree
zpe.sumelectthermalfe: -460.064863 hartree
dipole: 0.0194 -0.1351 0.0901
dipole: 0.1635
quadrupole: -56.9403 -71.1782 -67.5284
quadrupole: -3.5318 0.8094 -1.0090
quadrupole: 8.2753 -5.9625 -2.3128 -3.5318 0.8094 -1.0090
hfenergy: -460.2368258 hartree
pointgroup: C01 [X(C9H14N2)]
dipole: 0.0070719 -0.0523935 0.036676 debye
dipolederiv: -0.3106452 -0.001023 0.0201334 0.00621 -0.2679131 -0.0207571 0.0047143 -0.0086977 -0.2644549 -0.2872247 0.0079209 -0.0064526 0.0034421 -0.2787927 0.0030316 -0.00202 0.0003384 -0.2674018 0.4606299 0.1440812 -0.0146604 0.573747 -0.0827785 0.0494219 0.0634715 -0.0018762 0.0129839 -0.1006653 -0.0665651 0.0444978 -0.1261371 0.0976411 -0.0046351 0.1585943 0.0511037 0.0435481 0.0638868 -0.2081089 0.0119595 -0.6217773 0.3007538 -0.0477483 -0.0522476 -0.0227748 0.0542844 0.0842922 -0.2180988 -0.0149664 -0.647895 0.295035 -0.0341959 -0.053367 -0.0021199 0.0540771 0.4778221 0.1204534 0.0663832 0.5395116 -0.0912343 0.0434003 0.0958973 0.0042545 0.0677716 0.0065678 -0.022797 0.0221011 -0.0072378 0.0761998 0.0276723 -0.0949688 -0.0105538 0.0112759 -0.1481775 0.1737764 -0.0130661 0.1483756 -0.0854941 0.012974 -0.0247744 0.0322001 0.0551236 -0.1595538 0.1732499 -0.008737 0.1454584 -0.0718551 0.0067951 -0.0122689 0.0057029 0.0539441 -0.2711752 -0.0678875 -0.0422363 -0.0323809 0.0458429 -0.0066199 -0.0420878 -0.0091023 0.0475119 -0.023257 0.0466241 -0.0488581 0.0933939 -0.0326608 0.1220954 -0.0504249 0.0773682 0.0037947 0.0522271 0.0107327 0.0263365 -0.0483492 -0.0453303 -0.1164587 -0.0120438 -0.0822922 -0.0128493 0.0492924 0.1101131 -0.0650135 0.0604692 -0.019191 0.0951647 -0.0305748 0.0612636 0.0214514 -0.2092231 -0.1166345 -0.0004174 -0.1195526 0.0592272 0.0034066 0.0121681 0.0045924 0.064354 0.1002445 -0.0102943 0.008777 0.0358048 -0.0790922 -0.1415036 0.0143293 -0.0918112 -0.0218896 -0.0464197 0.0177672 0.1008875 -0.0066605 0.072824 0.0545608 0.127783 0.0085329 -0.0011262 0.0758457 -0.1256015 -0.0218307 -0.0189992 -0.0628198 -0.0291241 -0.0082902 -0.0504083 0.1053876 0.0356389 0.0512371 -0.0815988 0.0379847 0.0670562 -0.0214798 -0.1038197 0.0313596 -0.0799013 -0.0342509 0.0298018 0.1073518 -0.0061569 0.0623179 0.0571267 0.1316864 0.0059299 -0.0125837 0.0219316 0.0428023 -0.0890198 0.0260445 0.0694597 -0.0372559 -0.1205197 0.0210576 -0.0742849 0.0794279 -0.1250522 -0.0160716 -0.0152732 -0.069437 -0.0176386 -0.0061001 -0.0292157 0.1117576 0.104079 0.0327481 0.0013536 -0.0779508 -0.0975304 -0.0267429 -0.008533 -0.0144224 0.1143907 0.0122455 -0.0010233 -0.0579508 0.0273458 0.0561329 0.106916 -0.1089552 0.0654098 -0.0527344 -0.033539 0.0017776 0.0710979 0.030583 0.0816386 -0.0784056 0.1223519 -0.045839 -0.0344308 unknown
polarizability: 149.0732392|-5.1800722|112.9623428|4.3401867|0.6380172|71.1213566 unknown
InChI: InChI=1S/C9H14N2/c1-5-9-8(4)10-6(2)7(3)11-9/h5H2,1-4H3
charge 0 multiplicity 1
25 atoms
N  -0.035426 -1.240464 -0.258495
N  0.641431 1.481773 0.059887
C  -1.003321 -0.271322 -0.298674
C  -2.429022 -0.754462 -0.479144
C  -0.662026 1.105555 -0.136875
C  1.264103 -0.86516 -0.060651
C  1.606897 0.513571 0.099829
C  -3.091209 -1.114887 0.879145
C  -1.690268 2.215702 -0.178328
C  2.305048 -1.96064 -0.025394
C  3.032447 0.966808 0.317123
H  -3.035564 0.010792 -0.996687
H  -2.40492 -1.656392 -1.1162
H  -2.507797 -1.901283 1.389321
H  -4.119347 -1.489415 0.725281
H  -3.1436 -0.237395 1.549894
H  -2.50611 2.049075 0.549047
H  -1.194845 3.17094 0.054548
H  -2.158156 2.298952 -1.177956
H  3.06302 -1.827786 -0.821015
H  2.851089 -1.972422 0.937325
H  1.812127 -2.93506 -0.16539
H  3.054596 2.063265 0.413351
H  3.466555 0.519765 1.231933
H  3.686297 0.66979 -0.525176
