program: Gaussian 09
title: 000028595
version: EM64L-G09RevD.01
frameworkgroup: C1[X(C18H23F3O3)]
method: RPBEPBE
basis: SDD
operation: Freq
keyword: #p
keyword: freq=noraman
keyword: PBEPBE/SDD
title: #p freq=noraman PBEPBE/SDD
converged: NO YES NO NO
title: Mulliken charges:
elementType: F F F O O O C C C C C C C C C C C C C C C C C C H H H H H H H H H H H H H H H H H H H H H H H
charge: -0.166446 -0.165800 -0.166021 -0.291232 -0.196273 -0.241520 0.365610 -0.469154 -0.028531 -0.493435 -0.028007 -0.466100 -0.749158 -0.748716 -0.746839 0.230812 -0.411257 0.388484 -0.464674 -0.334461 0.322808 -0.203451 -0.392127 0.263022 0.200259 0.189042 0.229396 0.206881 0.245781 0.241431 0.193303 0.222063 0.210165 0.215258 0.213260 0.207734 0.232696 0.208237 0.215652 0.206464 0.218198 0.242266 0.245382 0.289032 0.256526 0.235495 0.267946
chargesum: 0.00000
title: Mulliken charges with hydrogens summed into heavy atoms:
elementType: F F F O O O C C C C C C C C C C C C C C C C C C
charge: -0.166446 -0.165800 -0.166021 -0.291232 -0.196273 -0.241520 0.365610 -0.079853 0.200865 -0.040773 0.213424 -0.050734 -0.110475 -0.100050 -0.106524 0.230812 0.076390 0.388484 -0.175642 -0.077935 0.322808 0.032044 -0.124181 0.263022
polarizability: 2.69499850e+02 -2.57930472e+00 1.86561627e+02 6.38601400e+00 1.65840068e+01 1.58162526e+02
1716.lowfreq: -9.0128 -5.7496 -0.0007 -0.0004 0.0006 4.1389 13.6119 21.9852 24.8227
frequency: -6.4179 17.3671 24.0374 29.3473 47.5940 54.1877 72.3705 104.4813 132.3135 137.8657 148.2423 158.0911 171.8407 200.2112 214.3413 219.6036 226.9737 237.2924 259.1173 272.2024 286.1419 303.8393 304.0100 321.9501 338.8618 344.7309 388.4793 400.6126 403.5320 433.7102 435.9212 466.6719 481.0653 483.3830 498.0175 531.8681 552.2197 569.0351 607.9835 618.6584 649.9836 685.7051 692.4052 725.0400 742.9821 787.6832 791.3484 843.3166 850.1100 854.0647 875.7319 894.2673 894.6280 896.7112 912.8233 915.8763 937.2754 949.2262 975.2033 982.1562 985.9984 988.3235 989.8295 1002.1006 1004.8462 1005.7059 1020.4351 1044.8836 1062.3483 1086.1802 1098.1744 1110.1231 1118.4949 1130.2484 1162.2565 1184.1061 1184.8617 1189.3639 1204.4471 1206.5712 1250.5469 1271.9285 1277.5196 1287.9782 1293.0480 1303.3892 1304.6958 1323.5948 1337.5597 1349.5041 1356.4457 1360.7600 1364.8569 1377.0553 1386.2569 1396.0713 1398.2733 1439.8625 1445.0797 1446.0566 1455.4513 1459.7820 1465.3285 1472.0934 1474.7436 1475.9349 1479.1024 1480.8461 1493.2759 1592.4342 1624.6263 1672.3214 2944.1861 2961.5853 2963.2395 2965.7425 2967.1006 2970.5822 2973.8474 2986.6715 3012.4931 3024.8506 3030.0992 3038.7344 3044.1127 3056.5222 3059.9550 3061.3333 3064.9154 3068.5347 3092.0847 3146.4836 3168.0279 3172.4437 3185.7756
redmass: 9.3762 6.3625 4.8236 5.3516 6.6346 6.3753 5.2681 3.6473 2.7844 4.8032 3.8713 3.5354 3.6885 1.1557 1.7637 1.7716 4.6586 1.8683 3.2450 1.9022 1.8857 6.4114 4.7669 3.2349 5.5428 3.1280 4.7329 2.1342 2.0165 4.8467 1.9271 4.7641 4.6963 3.2368 3.4321 7.2542 7.0694 3.5613 11.6022 5.8293 4.8968 7.1736 2.2026 5.5409 4.7781 2.8495 1.4605 2.0747 4.8929 1.7292 2.0485 2.5589 1.5715 1.4039 1.9872 4.4012 1.4582 1.7216 1.3942 5.7879 1.6289 8.1884 1.7094 1.8682 1.4755 5.3896 7.6059 1.5430 2.6934 2.6635 1.4276 1.7390 1.3982 3.4844 2.0049 1.2763 1.6880 2.1512 1.2886 1.7734 1.8340 1.6435 1.7747 3.0703 1.3586 1.5842 1.5036 1.5246 1.4166 1.4471 1.5504 1.6432 1.4715 1.2109 1.2191 1.2379 5.4956 1.9720 1.0835 1.0869 1.0789 1.4188 1.0557 1.0572 1.0464 1.0596 2.4779 1.0622 1.0595 6.3818 6.5963 10.8015 1.0615 1.0567 1.0379 1.0371 1.0577 1.0605 1.0449 1.0801 1.0987 1.1028 1.0866 1.0966 1.0985 1.0993 1.0990 1.0988 1.0987 1.0991 1.0973 1.0873 1.0935 1.0930 1.0970
irintensity: 0.5203 0.2351 0.7864 0.0914 0.5853 0.0154 0.3671 2.7284 0.3691 0.6282 5.8580 1.4792 4.2107 0.5997 2.3322 5.0884 0.5401 0.6318 3.1166 0.5640 0.8978 1.0274 4.9907 2.4586 2.9134 0.9196 1.8776 0.3918 0.3290 0.3598 0.8458 0.2385 4.5556 0.7820 3.8108 1.7741 2.3947 3.1138 14.9251 0.6357 5.2866 1.6092 26.1037 7.3322 7.1408 6.7453 69.6327 4.2867 55.7996 3.7283 1.6907 9.0531 17.3801 25.3454 5.8232 14.3313 1.7025 3.6258 19.0163 4.5563 4.9866 201.1163 7.3402 2.0964 12.5586 213.5880 361.0211 7.1891 19.0011 26.8668 15.1415 18.9954 10.5535 533.7561 6.2109 7.8943 8.1783 0.3831 24.5787 32.2663 7.7037 4.7334 8.2095 346.7635 9.5297 81.3089 1.3036 5.8261 27.6823 4.4276 1.7972 19.4640 5.8455 18.9140 8.1785 12.4301 3.3921 147.0422 11.2993 3.8920 4.6404 8.4003 1.2729 6.3320 20.7915 10.2746 37.2127 10.4815 22.3355 63.6065 39.0540 174.9820 34.2745 42.9269 25.5236 35.7227 31.0190 44.2256 11.8963 23.8709 34.3343 13.8759 29.3160 14.6480 20.5723 9.1822 30.8417 87.8793 59.6725 49.5700 34.8128 10.4169 9.3800 0.8990 3.9812
temp: 298.150 k
press: 1.00000 atm
elementType: 9 9 9 8 8 8 6 6 6 6 6 6 6 6 6 6 6 6 6 6 6 6 6 6 1 1 1 1 1 1 1 1 1 1 1 1 1 1 1 1 1 1 1 1 1 1 1
symmnumber: 1
zpe: 988173.8 jmol-1
zpe.correction: 0.376376 hartree
zpe.thermalcorrener: 0.399801 hartree
zpe.thermalcorrenthalpy: 0.400746 hartree
zpe.thermalcorrgfe: 0.322020 hartree
zpe.sumelectzpe: -1223.089927 hartree
zpe.sumelectthermal: -1223.066501 hartree
zpe.sumelectthermalent: -1223.065557 hartree
zpe.sumelectthermalfe: -1223.144283 hartree
dipole: -6.2113 4.1011 1.7757
dipole: 7.6520
quadrupole: -158.4591 -141.8655 -142.5468
quadrupole: 12.2841 7.4403 1.2203
quadrupole: -10.8353 5.7583 5.0770 12.2841 7.4403 1.2203
hfenergy: -1223.4663024 hartree
pointgroup: C01 [X(C18H23F3O3)]
dipole: 2.4256604 1.2604383 -1.2612294 debye
polarizability: 269.8885781|-0.3796022|175.131064|-0.9425332|-21.8266593|169.2043606 unknown
InChI: InChI=1S/C18H23F3O3/c1-12-7-15(10-17(2,3)9-12)24-16(22)11-23-14-6-4-5-13(8-14)18(19,20)21/h4-6,8,12,15H,7,9-11H2,1-3H3
charge 0 multiplicity 1
47 atoms
F  -7.304521 0.41036 0.04204
F  -6.24654 -1.548931 0.476202
F  -6.279935 0.084356 2.039845
O  2.315702 0.288688 0.611123
O  0.981621 -1.282347 1.726692
O  -1.280363 -0.079747 0.674797
C  4.662188 -1.222932 -0.996895
C  5.698487 -0.066569 -0.853787
C  5.146709 1.200877 -0.153199
C  4.042403 -1.530381 0.39988
C  3.572787 -0.307268 1.212977
C  4.60252 0.828631 1.247508
C  5.391317 -2.497724 -1.496368
C  3.567488 -0.851567 -2.035219
C  6.228459 2.297007 -0.049689
C  1.109256 -0.316862 0.951733
C  0.001727 0.415619 0.194514
C  -2.43561 0.458894 0.092332
C  -3.650474 -0.055509 0.600885
C  -2.444795 1.443374 -0.929018
C  -4.870868 0.421701 0.082255
C  -3.681369 1.904959 -1.432826
C  -4.901333 1.403809 -0.936821
C  -6.148699 -0.139296 0.640748
H  6.08735 0.199346 -1.857747
H  6.567028 -0.437175 -0.266422
H  4.304077 1.601571 -0.752139
H  4.81501 -2.030151 1.021577
H  3.208597 -2.251262 0.304692
H  3.295641 -0.632115 2.233454
H  5.448059 0.492104 1.883465
H  4.157158 1.712095 1.74231
H  6.196742 -2.798597 -0.799434
H  4.68921 -3.347979 -1.591713
H  5.848415 -2.325047 -2.489093
H  2.835625 -1.675738 -2.138013
H  3.014018 0.058189 -1.74865
H  4.02524 -0.682723 -3.028538
H  5.837757 3.203958 0.449046
H  7.09841 1.938546 0.534727
H  6.595199 2.592009 -1.050339
H  0.127135 0.219104 -0.890825
H  0.106902 1.50516 0.36585
H  -3.613857 -0.814435 1.387771
H  -1.513978 1.851796 -1.332911
H  -3.688367 2.664558 -2.221148
H  -5.856326 1.763044 -1.327929
