program: Gaussian 09
title: 000028521
version: EM64L-G09RevD.01
frameworkgroup: C1[X(C15H24O)]
method: RPBEPBE
basis: SDD
operation: Freq
keyword: #pfreq=noraman
keyword: PBEPBE/SDD
title: #p freq=noraman PBEPBE/SDD
converged: YES YES NO NO
title: Mulliken charges:
elementType: O C C C C C C C C C C C C C C C H H H H H H H H H H H H H H H H H H H H H H H H
charge: -0.437007 -0.410328 -0.373925 -0.222622 -0.373202 -0.375761 -0.353447 0.548987 -0.727993 -0.356712 -0.436783 -0.383857 -0.696766 -0.384695 -0.365455 0.275134 0.193873 0.195712 0.215815 0.183192 0.202261 0.187463 0.191327 0.188045 0.192359 0.186696 0.188213 0.211960 0.211205 0.226941 0.194241 0.195495 0.231330 0.230284 0.209905 0.209274 0.214675 0.216048 0.246874 0.351242
chargesum: 0.00000
title: Mulliken charges with hydrogens summed into heavy atoms:
elementType: O C C C C C C C C C C C C C C C
charge: -0.085764 -0.020743 0.025082 -0.020361 0.005588 0.004643 0.021462 0.548987 -0.077886 0.033024 -0.205453 -0.153573 -0.062913 -0.168647 -0.118581 0.275134
polarizability: 1.73043813e+02 -2.21859499e+01 1.71360347e+02 1.55726712e+00 -2.49689597e+00 1.48223817e+02
1716.lowfreq: -8.1835 -5.6656 -0.0007 0.0002 0.0006 4.5522 19.3991 26.4614 49.5838
frequency: 19.2755 26.0605 49.1462 52.5295 62.7115 95.9101 105.9397 129.7331 141.7898 148.7501 188.7545 199.4662 219.4845 227.0183 241.0336 257.9173 333.1032 355.3775 384.5902 395.3694 410.4997 422.1497 471.1485 485.5996 531.3652 546.2609 635.7923 684.3975 720.1528 728.3015 732.6988 760.9812 804.6997 810.4194 823.3699 833.7066 887.5093 892.7927 904.8723 929.7249 956.3997 971.3604 991.7296 1002.0579 1006.1946 1011.5187 1049.2331 1065.3986 1072.7794 1078.0723 1084.8161 1104.0424 1119.9713 1140.9045 1146.4396 1178.5717 1188.6423 1202.4679 1224.0784 1228.1788 1245.8705 1260.3541 1264.5841 1277.8382 1285.9656 1289.5382 1292.7538 1301.3922 1317.4780 1341.7491 1345.0843 1354.5280 1354.8459 1384.0564 1389.0391 1392.6371 1426.7564 1459.1100 1461.6380 1463.8299 1468.8260 1470.7381 1475.0026 1476.2217 1477.6606 1483.9132 1488.7550 1502.8484 1597.1739 1625.3900 2948.3169 2949.5337 2953.8352 2956.0365 2960.8022 2966.0960 2967.8546 2971.1733 2972.9056 2983.0654 2991.9226 3002.1189 3013.1135 3029.1926 3040.8923 3066.8726 3067.5586 3069.8785 3076.9422 3106.7347 3123.7534 3132.7486 3165.7647 3581.9917
redmass: 4.6076 3.4808 1.5774 3.3861 3.6347 2.0549 2.2465 3.4202 1.9954 2.5214 2.1568 3.0229 1.3558 1.1174 2.6879 4.0219 3.4565 1.1147 3.6157 3.8613 2.9490 3.6031 3.4696 3.0912 2.8180 2.3234 6.8776 2.8846 1.0693 1.3540 2.1478 1.2120 1.3545 3.9256 1.3516 1.5547 1.8895 1.6103 1.4277 1.3848 1.3724 1.4233 2.4007 2.9622 2.6653 1.6246 2.9499 1.8034 1.8423 2.1175 2.1916 1.6582 2.3590 1.6741 1.6268 1.1115 1.7237 1.7320 1.4281 1.4278 2.6837 1.2963 1.2947 1.0378 1.2187 1.1087 1.2443 1.3208 1.3680 1.4610 1.4890 1.6183 1.6987 1.2663 1.2188 4.2758 2.6174 1.0769 1.0728 1.0698 1.0735 1.0528 1.0727 1.0426 1.0797 1.0865 1.0920 2.6461 6.3166 6.5008 1.0589 1.0589 1.0604 1.0610 1.0675 1.0721 1.0614 1.0366 1.0356 1.0958 1.0976 1.0993 1.1035 1.1043 1.1041 1.0994 1.1006 1.0993 1.0998 1.0873 1.0891 1.0960 1.0952 1.0660
irintensity: 0.0177 1.1234 0.0077 0.1135 0.0674 0.0580 0.0792 0.2157 0.0044 0.0251 0.4551 0.0022 0.0759 0.0004 0.0332 0.0248 1.2697 144.3295 8.2326 2.3009 1.8950 3.6618 4.1759 1.4610 0.0305 33.3524 0.4326 18.0378 11.0270 1.4382 1.2216 1.4809 24.7059 12.4669 1.5182 45.5801 4.6623 2.4161 0.7459 0.2715 0.2126 2.9351 1.5894 4.3380 0.1215 1.7061 0.1943 6.1205 2.7946 0.5948 5.6279 44.9514 10.0249 148.0683 82.2981 4.2611 0.4318 2.0644 4.7686 0.2078 28.2180 0.7327 0.2742 0.7135 0.7173 1.6840 1.4682 18.1868 0.5307 3.3203 0.8281 1.9606 0.6722 13.9790 11.3459 12.7643 11.7620 0.5578 0.0878 0.0955 0.7028 13.3428 2.1415 12.1436 0.4687 2.5771 24.3026 96.2491 10.5980 28.5946 0.5366 0.2407 5.3455 3.2642 24.5221 6.2416 179.1147 38.2725 51.8394 3.0119 2.8370 6.9300 3.9955 2.1673 169.9467 46.1494 112.2491 54.5059 37.7764 20.2207 19.3500 16.2650 6.7679 35.3816
temp: 298.150 k
press: 1.00000 atm
elementType: 8 6 6 6 6 6 6 6 6 6 6 6 6 6 6 6 1 1 1 1 1 1 1 1 1 1 1 1 1 1 1 1 1 1 1 1 1 1 1 1
symmnumber: 1
zpe: 924402.0 jmol-1
zpe.correction: 0.352086 hartree
zpe.thermalcorrener: 0.370581 hartree
zpe.thermalcorrenthalpy: 0.371525 hartree
zpe.thermalcorrgfe: 0.303198 hartree
zpe.sumelectzpe: -659.962878 hartree
zpe.sumelectthermal: -659.944383 hartree
zpe.sumelectthermalent: -659.943439 hartree
zpe.sumelectthermalfe: -660.011766 hartree
dipole: -0.1914 0.2741 1.6409
dipole: 1.6746
quadrupole: -104.1002 -97.1412 -94.9752
quadrupole: -3.5473 7.5318 -5.2799
quadrupole: -5.3614 1.5977 3.7637 -3.5473 7.5318 -5.2799
hfenergy: -660.3149638 hartree
pointgroup: C01 [X(C15H24O1)]
dipole: -0.0752727 0.1224781 0.6429815 debye
polarizability: 173.1594735|-22.1408468|171.1195963|2.0625874|-3.0100697|148.3489066 unknown
InChI: InChI=1S/C15H24O/c1-3-4-5-6-7-8-13(2)14-9-11-15(16)12-10-14/h9-13,16H,3-8H2,1-2H3
charge 0 multiplicity 1
40 atoms
O  4.271143 -2.962158 -0.297695
C  -0.063911 1.939733 -0.317173
C  -1.011005 0.919519 0.351206
C  1.354999 2.002205 0.319804
C  -2.412776 0.881729 -0.298035
C  -3.370283 -0.128712 0.372891
C  -4.771753 -0.169528 -0.276964
C  2.118918 0.682429 0.176941
C  2.167702 3.186777 -0.268498
C  -5.729161 -1.180748 0.394149
C  2.565244 -0.031786 1.315152
C  2.41683 0.13768 -1.102308
C  -7.127674 -1.213356 -0.259522
C  3.282864 -1.244339 1.195484
C  3.128925 -1.068736 -1.24409
C  3.563501 -1.761343 -0.090265
H  -0.518124 2.950956 -0.261726
H  0.030538 1.701473 -1.397085
H  -0.556399 -0.090295 0.305379
H  -1.11351 1.167182 1.429137
H  1.220005 2.193936 1.405148
H  -2.864619 1.895565 -0.259933
H  -2.309742 0.628609 -1.374242
H  -3.473143 0.122931 1.44951
H  -2.918341 -1.141964 0.333328
H  -5.22486 0.84354 -0.237909
H  -4.670154 -0.422069 -1.353422
H  1.642309 4.145187 -0.098023
H  2.308163 3.06901 -1.359449
H  3.169368 3.251958 0.193171
H  -5.82779 -0.929284 1.470127
H  -5.276285 -2.192548 0.352553
H  2.34918 0.363174 2.31547
H  2.087265 0.662552 -2.007093
H  -7.058632 -1.492073 -1.328132
H  -7.614004 -0.220916 -0.203864
H  -7.792188 -1.943718 0.2380
H  3.616707 -1.778048 2.095396
H  3.357327 -1.487342 -2.228971
H  4.529364 -3.368781 0.56635
