program: Gaussian 09
title: 000028495
version: EM64L-G09RevD.01
frameworkgroup: C1[X(C8H7NO4)]
method: RPBEPBE
basis: SDD
operation: Freq
keyword: #pfreq=noraman
keyword: PBEPBE/SDD
title: #p freq=noraman PBEPBE/SDD
converged: YES YES NO NO
title: Mulliken charges:
elementType: O O O O N C C C C C C C C H H H H H H H
charge: -0.232959 -0.371196 -0.379517 -0.278830 -0.161413 0.319527 0.200567 -0.199419 0.179078 -0.350512 -0.331658 -0.212387 -0.219085 0.273206 0.277619 0.260730 0.236838 0.237689 0.365057 0.386664
chargesum: 0.00000
title: Mulliken charges with hydrogens summed into heavy atoms:
elementType: O O O O N C C C C C C C C
charge: -0.232959 -0.006138 0.007146 -0.278830 -0.161413 0.319527 0.200567 0.073787 0.179078 -0.072893 -0.070928 0.024452 0.018603
polarizability: 1.61786229e+02 3.99277227e-01 1.09735403e+02 -6.16524633e+00 7.43629341e+00 5.45528531e+01
1716.lowfreq: -11.5844 -0.0002 0.0002 0.0007 4.3362 8.4385 78.9925 85.4109 141.1467
frequency: 78.9709 85.4026 141.1457 189.4358 257.1694 281.0027 306.9955 319.6966 352.9293 395.5283 426.6406 446.7527 474.8953 496.0786 532.6226 545.3828 579.0356 664.3556 679.9783 712.9265 742.0816 762.5547 788.9260 865.3977 896.7329 937.4688 944.8370 978.1129 980.7686 1026.7392 1048.4531 1108.2492 1168.2657 1180.4158 1220.1525 1267.4480 1270.7539 1298.5196 1316.9579 1378.1397 1388.4240 1431.9318 1468.0680 1501.8291 1566.5226 1597.7638 1613.9997 3146.3352 3155.1349 3162.6141 3177.7546 3188.9801 3252.5238 3539.0056
redmass: 6.0976 8.2094 6.0763 5.7291 5.7768 4.1500 4.4288 2.7109 2.2277 7.6322 4.8162 5.0764 2.0028 1.7894 6.5662 4.2428 6.1945 6.7235 7.6229 4.5229 4.5897 1.2833 5.2684 1.3922 9.4339 5.1831 1.3958 5.8631 1.3082 2.0042 6.0417 1.9488 1.1068 2.0952 1.3712 2.4199 1.6138 1.8532 2.0824 1.1564 6.7628 1.9888 2.5054 2.9541 8.9073 6.8692 7.0699 1.0864 1.0891 1.0915 1.0963 1.0979 1.0641 1.0664
irintensity: 0.1968 0.3662 0.8968 0.9948 4.5803 2.3742 10.9644 43.1218 65.1353 18.8884 2.7521 2.6582 67.1400 90.6000 7.9698 3.1593 6.1168 7.0973 9.9753 1.6279 13.3754 103.8540 39.5843 1.1503 173.6203 147.9157 20.4854 67.8381 0.0562 10.8655 12.7297 9.6521 2.3577 25.2892 65.6067 54.6571 10.9306 25.1821 46.4640 17.4217 12.9826 10.8315 48.2560 160.5245 404.4492 31.4231 10.4779 2.6355 4.0693 12.9716 6.5254 3.1903 44.9709 18.3801
temp: 298.150 k
press: 1.00000 atm
elementType: 8 8 8 8 7 6 6 6 6 6 6 6 6 1 1 1 1 1 1 1
symmnumber: 1
zpe: 372868.9 jmol-1
zpe.correction: 0.142018 hartree
zpe.thermalcorrener: 0.152757 hartree
zpe.thermalcorrenthalpy: 0.153701 hartree
zpe.thermalcorrgfe: 0.105819 hartree
zpe.sumelectzpe: -663.698347 hartree
zpe.sumelectthermal: -663.687608 hartree
zpe.sumelectthermalent: -663.686664 hartree
zpe.sumelectthermalfe: -663.734546 hartree
dipole: -3.2411 0.8607 0.9753
dipole: 3.4924
quadrupole: -75.8394 -75.3901 -74.9387
quadrupole: 2.0350 -1.2312 2.6300
quadrupole: -0.4500 -0.0007 0.4507 2.0350 -1.2312 2.6300
hfenergy: -663.8403651 hartree
pointgroup: C01 [X(C8H7N1O4)]
dipole: 1.2733735 -0.2735719 0.4377218 debye
dipolederiv: -1.2392896 0.3305603 0.1285661 0.1853602 -0.4390735 0.0185883 -0.0600326 0.0483136 -0.4104579 -0.4705869 -0.1153319 0.1107365 -0.0080522 -0.4384139 -0.1742852 0.5090345 -0.3168915 -0.7932399 -0.2324197 -0.0916287 0.0427016 -0.02644 -0.6019125 -0.0374826 -0.0304482 -0.0361092 -0.3228944 -1.4112621 -0.1065816 -0.1767203 -0.5483125 -0.5370412 -0.1163712 -0.2430438 -0.0507028 -0.3856205 -1.1149582 -0.0398062 -0.1697057 0.3557483 0.2966488 0.0528728 -0.1290941 0.0364066 -0.0817117 0.6933885 0.2137453 0.0816849 0.4337071 -0.0599975 0.0390998 0.0216216 0.0357781 0.0595241 0.5915896 -0.3487349 0.111923 -0.5737596 0.2829269 -0.020043 0.2455331 -0.1098168 0.0550041 1.049636 -0.1261653 -0.2978937 -0.0785481 0.416562 0.0839115 -0.5500153 0.2159865 0.9874246 1.8154495 0.1067769 0.333525 -0.0106266 0.2571875 0.0486291 0.4129709 0.0935614 0.1216326 -0.0286125 -0.0041173 0.0199745 0.0589142 0.0367462 -0.0262756 0.0313955 -0.0100918 -0.1412753 -0.1108107 0.1469239 0.0042334 0.019098 0.0448099 -0.0577406 -0.0148912 -0.0379717 -0.128722 -0.0138712 -0.0598409 0.0420237 -0.1607291 -0.0306326 -0.0495717 0.0488832 -0.0382999 -0.1502236 -0.0178597 -0.0063518 0.0269015 0.10943 0.0382773 -0.0213407 -0.0041672 -0.0339562 -0.1498883 0.0073092 0.0274328 -0.0351171 0.0219468 0.059124 0.0245623 -0.0039555 -0.0026909 0.0314183 0.106705 -0.0315432 -0.0072404 -0.01436 0.0050596 0.0319925 0.0030653 0.0272319 0.1745455 0.1019668 0.0037832 -0.013482 -0.0146782 -0.0288946 0.0387091 0.0018503 0.0354203 0.1616332 -0.0425327 0.0763583 -0.0464965 0.0876498 0.0337806 0.0390678 -0.0499155 0.0362315 0.1502731 -0.0753161 -0.0753316 -0.0183281 -0.0757567 0.0610617 0.0084396 -0.0147978 0.0097748 0.1603053 0.223437 0.1324698 -0.0967718 0.1214428 0.1858602 0.090805 -0.1339422 0.1081569 0.290925 0.1680379 -0.0326172 -0.0405146 0.1179657 0.4179213 0.0264328 -0.0400513 -0.010331 0.3713479 unknown
polarizability: 160.5358544|3.6418616|110.5299227|12.2922118|-4.2595157|55.0087072 unknown
InChI: InChI=1S/C8H7NO4/c10-7-8(11)13-6-4-2-1-3-5(6)9(7)12/h1-4,8,11-12H
charge 0 multiplicity 1
20 atoms
O  -0.38611 1.612559 -0.70337
O  -1.952573 1.579336 1.151933
O  -0.852671 -2.513952 -0.241722
O  -2.987426 -0.945004 -0.623831
N  -0.727173 -1.082669 -0.195137
C  0.577246 -0.558846 -0.052399
C  0.725119 0.833755 -0.307115
C  -1.708496 1.162286 -0.204901
C  -1.883868 -0.352871 -0.385899
C  1.696221 -1.351657 0.282514
C  1.993217 1.433918 -0.231237
C  2.967037 -0.742105 0.356473
C  3.116627 0.642209 0.09953
H  -2.437326 1.707783 -0.816687
H  1.561077 -2.421255 0.460401
H  2.08203 2.50467 -0.436181
H  3.840751 -1.35004 0.611071
H  4.105344 1.107958 0.15829
H  -1.457793 1.012254 1.7995
H  -1.840234 -2.61773 -0.441633
