program: Gaussian 09
title: 000028476
version: EM64L-G09RevD.01
frameworkgroup: C1[X(C13H28)]
method: RPBEPBE
basis: SDD
operation: Freq
keyword: #p
keyword: freq=noraman
keyword: PBEPBE/SDD
title: #p freq=noraman PBEPBE/SDD
converged: YES YES NO NO
title: Mulliken charges:
elementType: C C C C C C C C C C C C C H H H H H H H H H H H H H H H H H H H H H H H H H H H H
charge: -0.007205 -0.436327 -0.407612 -0.400425 -0.037002 -0.384181 -0.757971 -0.361973 -0.354555 -0.717094 -0.719428 -0.355158 -0.696452 0.214111 0.199576 0.195443 0.185070 0.183890 0.190805 0.199148 0.209007 0.188831 0.200708 0.219471 0.210848 0.208186 0.186836 0.184754 0.186512 0.186893 0.211098 0.212307 0.204001 0.209453 0.205977 0.219314 0.194581 0.194559 0.209661 0.214822 0.209520
chargesum: 0.00000
title: Mulliken charges with hydrogens summed into heavy atoms:
elementType: C C C C C C C C C C C C C
charge: 0.206906 -0.041308 -0.038652 -0.010471 0.172005 0.005358 -0.119467 0.009617 0.018850 -0.089688 -0.084683 0.033983 -0.062450
polarizability: 1.70489070e+02 7.33714590e-01 1.32889758e+02 -1.08144850e+00 -1.65644940e-01 1.22943266e+02
1716.lowfreq: -3.3292 -0.0008 -0.0004 0.0005 8.3053 11.0944 24.8950 37.5948 50.9724
frequency: 24.7540 37.4224 50.7656 51.9388 75.0102 105.4328 112.1119 127.6534 139.1267 156.9998 195.9462 210.0764 229.2476 231.1218 248.9281 254.6432 282.3258 314.6951 348.8450 391.6712 407.7562 415.2973 449.8979 461.4268 553.7841 720.9825 727.2565 755.7525 796.4555 804.9281 826.6933 876.0346 888.3848 891.7839 912.8054 917.1096 956.2517 961.3768 972.5256 986.4691 1003.3344 1031.2053 1047.5124 1058.0369 1077.3096 1083.2087 1100.7408 1104.3332 1145.5287 1158.3274 1169.5747 1179.8394 1195.0178 1209.4123 1236.7007 1243.5303 1267.5805 1277.9872 1279.3493 1283.9370 1290.9374 1291.2987 1314.9714 1321.4011 1332.6230 1335.1497 1348.6575 1352.7761 1357.3788 1358.4112 1376.0290 1385.8449 1388.0571 1392.9943 1454.8080 1457.6181 1462.3786 1464.4563 1467.8531 1469.3775 1470.7060 1473.6661 1476.5978 1476.9692 1481.0471 1481.5482 1487.9474 1488.9431 1493.6379 2940.1741 2946.8554 2948.0058 2950.9547 2957.1898 2960.0894 2963.5048 2965.4486 2966.6993 2967.4016 2968.9457 2970.6906 2970.9492 2983.3942 2993.7234 3000.9412 3005.4298 3015.3474 3026.6781 3039.0724 3055.3019 3057.7050 3062.3505 3065.2887 3067.3620 3068.7157 3069.8100 3071.3169
redmass: 3.4301 2.8313 1.7955 2.3028 3.0211 2.2841 2.3993 1.9453 2.3525 2.3126 1.3060 1.1074 1.4283 1.1259 2.4230 1.5891 1.8487 2.3550 2.7351 2.1036 2.2710 2.6590 1.9483 2.9199 2.5923 1.1156 1.2096 1.3563 1.7671 1.8648 1.5140 1.5032 1.4016 1.5995 1.4461 1.3831 1.4169 1.7807 1.4365 1.4519 3.4203 1.6992 1.5284 2.9918 2.2080 2.2183 1.8498 1.9899 2.3703 2.0580 2.1215 1.8316 1.6210 1.4952 1.3658 1.3314 1.3159 1.1198 1.2355 1.1295 1.1354 1.2747 1.2748 1.3355 1.4027 1.3735 1.5131 1.6592 1.4875 1.4947 1.2147 1.2149 1.2168 1.2163 1.0812 1.0733 1.0711 1.0763 1.0691 1.0457 1.0605 1.0710 1.0425 1.0615 1.0539 1.0724 1.0807 1.0542 1.0698 1.0587 1.0617 1.0590 1.0595 1.0604 1.0808 1.0359 1.0490 1.0528 1.0439 1.0681 1.0532 1.0446 1.0958 1.0979 1.1000 1.1009 1.1006 1.1032 1.1038 1.0992 1.0987 1.0991 1.0992 1.1006 1.0986 1.0993 1.0981
irintensity: 0.0014 0.0023 0.0025 0.0102 0.0130 0.0054 0.0092 0.0029 0.0039 0.0280 0.0185 0.0157 0.0822 0.0039 0.0096 0.1605 0.2033 0.2207 0.0892 0.6034 0.2677 0.0936 0.6387 0.2358 0.5867 14.0228 1.0426 2.6787 5.5232 0.7635 2.2870 2.1056 0.8415 5.7549 1.5887 3.9444 0.1354 2.9358 4.2735 7.7096 0.5043 0.7627 4.8067 0.2568 1.2489 0.9440 14.4878 0.8075 2.2830 1.1376 5.0694 9.1342 0.8645 2.0281 3.4241 0.7416 1.2948 0.2846 0.5421 0.5276 0.9745 0.1342 0.0820 0.2524 0.6138 2.3883 1.9823 1.6912 3.2197 0.8411 18.9526 16.1031 11.3472 17.2855 0.7390 2.1669 0.6980 0.3603 3.6762 6.1962 2.6229 6.6610 12.5028 6.6049 10.0940 5.0878 17.0870 20.1718 8.8301 33.4202 25.4358 0.6164 3.7682 32.0107 4.7930 41.4041 31.4956 11.7538 88.3229 23.1106 121.7941 16.9326 1.5423 0.6822 16.5147 33.7338 43.7502 5.4174 165.9973 8.4970 38.5291 84.5919 53.7798 100.5500 72.5756 55.4195 59.1221
temp: 298.150 k
press: 1.00000 atm
elementType: 6 6 6 6 6 6 6 6 6 6 6 6 6 1 1 1 1 1 1 1 1 1 1 1 1 1 1 1 1 1 1 1 1 1 1 1 1 1 1 1 1
symmnumber: 1
zpe: 999106.6 jmol-1
zpe.correction: 0.380540 hartree
zpe.thermalcorrener: 0.398520 hartree
zpe.thermalcorrenthalpy: 0.399464 hartree
zpe.thermalcorrgfe: 0.333393 hartree
zpe.sumelectzpe: -511.068722 hartree
zpe.sumelectthermal: -511.050742 hartree
zpe.sumelectthermalent: -511.049797 hartree
zpe.sumelectthermalfe: -511.115868 hartree
dipole: -0.0305 -0.0087 -0.1218
dipole: 0.1258
quadrupole: -88.8274 -87.7122 -86.2897
quadrupole: 0.2609 0.0380 -0.3813
quadrupole: -1.2176 -0.1024 1.3200 0.2609 0.0380 -0.3813
hfenergy: -511.4492615 hartree
pointgroup: C01 [X(C13H28)]
dipole: -0.0121542 -0.0039996 -0.0478205 debye
polarizability: 170.4768929|0.8240291|132.8891488|-1.2498839|-0.2809382|122.9560521 unknown
InChI: InChI=1S/C13H28/c1-5-6-7-8-9-10-13(4)11-12(2)3/h12-13H,5-11H2,1-4H3
charge 0 multiplicity 1
41 atoms
C  1.746313 -0.73306 0.510804
C  1.149629 -0.899137 -0.914633
C  3.26222 -0.391202 0.458179
C  -0.35769 -1.25138 -0.979748
C  3.670438 0.900435 -0.302485
C  -1.287066 -0.194308 -0.339188
C  1.534294 -2.001566 1.372584
C  -2.786332 -0.529558 -0.508469
C  -3.727838 0.513472 0.134561
C  5.208801 1.066704 -0.270633
C  2.978563 2.160442 0.270408
C  -5.225733 0.167116 -0.026518
C  -6.160088 1.215764 0.6146
H  1.223093 0.106736 1.013385
H  1.308308 0.039137 -1.484355
H  1.728571 -1.687102 -1.442953
H  3.798805 -1.252226 0.003422
H  3.638891 -0.307438 1.500802
H  -0.643815 -1.373551 -2.045321
H  -0.539963 -2.23509 -0.501902
H  3.366584 0.794582 -1.36474
H  -1.07833 0.798592 -0.791391
H  -1.059745 -0.09701 0.742019
H  0.463063 -2.222738 1.528771
H  2.00047 -1.883279 2.369091
H  1.99435 -2.885591 0.888619
H  -2.988508 -1.527722 -0.065433
H  -3.021673 -0.618479 -1.590111
H  -3.489092 0.607734 1.214955
H  -3.532898 1.510663 -0.313371
H  5.529048 1.95404 -0.848337
H  5.717344 0.180548 -0.695262
H  5.565983 1.194292 0.770016
H  3.321269 3.071514 -0.255131
H  3.217157 2.280946 1.345512
H  1.878751 2.109713 0.171806
H  -5.419037 -0.827805 0.424559
H  -5.46238 0.069062 -1.105894
H  -6.008872 2.212318 0.157997
H  -7.224255 0.943678 0.487939
H  -5.961929 1.311754 1.699044
