program: Gaussian 09
title: 000028469
version: EM64L-G09RevD.01
frameworkgroup: C1[X(C13H28)]
method: RPBEPBE
basis: SDD
operation: Freq
keyword: #p
keyword: freq=noraman
keyword: PBEPBE/SDD
title: #p freq=noraman PBEPBE/SDD
converged: YES YES NO NO
title: Mulliken charges:
elementType: C C C C C C C C C C C C C H H H H H H H H H H H H H H H H H H H H H H H H H H H H
charge: 0.008834 -0.408927 -0.394010 -0.385616 -0.385401 -0.381460 -0.374774 -0.373199 -0.742573 -0.353117 -0.709483 -0.356828 -0.696758 0.182149 0.188992 0.199546 0.188308 0.203859 0.191052 0.193300 0.192202 0.192676 0.191431 0.191961 0.191414 0.192971 0.189167 0.189421 0.209190 0.203983 0.223284 0.187444 0.187591 0.208467 0.217731 0.213817 0.194801 0.194619 0.209598 0.209586 0.214754
chargesum: 0.00000
title: Mulliken charges with hydrogens summed into heavy atoms:
elementType: C C C C C C C C C C C C C
charge: 0.190984 -0.020390 -0.001843 -0.001264 -0.000523 0.001932 0.009611 0.005388 -0.106117 0.021918 -0.069468 0.032591 -0.062821
polarizability: 1.80822414e+02 6.88415778e-01 1.29902636e+02 1.03829577e-01 -8.22771569e-01 1.18679717e+02
1716.lowfreq: -16.8750 -8.3130 -0.0002 0.0004 0.0017 9.0682 13.9736 19.5681 40.0165
frequency: 8.3101 18.9882 39.9844 53.1579 57.5097 81.1097 98.1113 107.2962 113.0302 141.0993 145.5575 162.0195 191.3198 208.9191 231.9186 232.7428 262.2085 308.7791 349.9787 396.1570 416.0933 449.9444 487.3101 493.4313 716.9053 720.5363 731.1687 758.9082 760.5577 801.1878 819.0921 870.5498 887.5136 904.6403 933.4405 960.4560 985.6675 992.9210 995.8505 1019.2973 1024.8672 1038.5555 1052.5295 1057.5028 1074.7703 1080.8557 1083.2172 1111.1070 1136.8188 1164.6771 1174.3622 1188.6467 1209.6869 1218.1122 1239.2775 1250.4657 1261.1196 1275.5235 1278.8299 1282.8221 1285.6453 1290.6381 1293.9955 1297.4878 1310.1962 1327.8165 1343.1240 1345.3262 1350.9593 1354.6901 1354.9266 1385.9208 1387.4577 1388.1325 1455.3279 1458.6604 1459.5494 1462.4260 1462.9935 1466.7716 1472.9698 1477.2436 1477.7389 1478.4914 1479.8198 1482.9902 1484.8683 1485.9270 1488.1584 2938.8846 2947.5827 2948.1674 2949.6837 2950.1997 2952.7344 2957.6330 2959.4353 2963.1981 2967.5319 2968.8318 2970.7806 2973.6004 2981.3332 2985.8417 2992.8425 3000.5924 3009.0489 3011.6640 3023.0198 3034.2553 3041.9484 3058.5065 3066.3544 3067.5181 3069.5949 3072.4534 3074.4061
redmass: 1.8321 3.0094 3.5855 1.6874 2.6871 1.8458 2.5357 2.7335 1.7594 2.1390 1.9113 2.9207 2.5625 1.2408 1.2340 1.1361 2.5618 2.6938 2.6391 2.9271 2.5028 2.4422 2.6785 2.8968 1.0613 1.0741 1.1098 1.1670 1.3670 1.4206 1.4519 1.2434 1.9066 2.0694 1.2205 1.2103 3.2336 1.3640 2.4896 2.1273 1.4305 2.0546 2.6816 2.5513 2.5416 2.0657 2.2723 2.1063 2.7363 2.0211 2.0017 1.7320 1.3062 1.4656 1.3170 1.2997 1.2894 1.1417 1.0837 1.2554 1.0971 1.1538 1.1092 1.1773 1.3169 1.3899 1.4929 1.5232 1.6437 1.6394 1.6366 1.2083 1.2125 1.2173 1.0699 1.0734 1.0703 1.0668 1.0753 1.0834 1.0823 1.0425 1.0582 1.0646 1.0654 1.0529 1.0782 1.0631 1.0925 1.0791 1.0590 1.0588 1.0609 1.0596 1.0598 1.0595 1.0596 1.0595 1.0584 1.0377 1.0367 1.0370 1.0960 1.0970 1.0984 1.1002 1.1018 1.1021 1.1042 1.1045 1.1043 1.0987 1.0992 1.1007 1.0993 1.0994 1.0982
irintensity: 0.0002 0.0016 0.0090 0.0058 0.0011 0.0107 0.0003 0.0027 0.0101 0.0024 0.0019 0.0007 0.0309 0.0210 0.0628 0.0140 0.0453 0.0324 0.1074 0.5195 0.3051 0.6544 0.0634 0.6520 15.6058 1.5979 3.5866 1.4445 6.3991 1.9311 0.8403 0.7882 4.9673 0.4083 1.2445 11.4912 0.7812 2.6086 3.5196 6.3055 1.2029 0.6750 1.0206 0.3055 0.0632 0.0604 0.3257 13.1354 2.1143 0.4488 1.4555 1.0552 12.3937 1.6015 0.0703 1.6241 0.1327 0.5318 0.2664 0.3128 0.5569 0.1803 0.2591 1.3866 1.1081 1.5829 1.0599 2.6737 1.5201 0.4740 1.0963 1.1771 30.3159 11.7166 1.0738 0.0245 0.3128 0.1115 2.4134 0.0358 1.9441 12.2064 5.5746 1.8619 7.3185 10.5113 6.2429 12.3349 34.4718 5.8640 0.3489 1.0265 2.2626 1.7473 2.7247 7.2782 28.5962 104.8423 187.0709 57.4482 35.3362 25.2324 0.1862 0.2120 0.6273 3.0552 19.5673 9.0151 8.0256 2.6730 262.3680 47.5305 63.6568 99.7645 57.6020 51.6325 73.0575
temp: 298.150 k
press: 1.00000 atm
elementType: 6 6 6 6 6 6 6 6 6 6 6 6 6 1 1 1 1 1 1 1 1 1 1 1 1 1 1 1 1 1 1 1 1 1 1 1 1 1 1 1 1
symmnumber: 1
zpe: 998076.2 jmol-1
zpe.correction: 0.380147 hartree
zpe.thermalcorrener: 0.398590 hartree
zpe.thermalcorrenthalpy: 0.399534 hartree
zpe.thermalcorrgfe: 0.329823 hartree
zpe.sumelectzpe: -511.069576 hartree
zpe.sumelectthermal: -511.051133 hartree
zpe.sumelectthermalent: -511.050188 hartree
zpe.sumelectthermalfe: -511.119900 hartree
dipole: -0.0587 0.0108 -0.0482
dipole: 0.0767
quadrupole: -88.5583 -87.7128 -85.8952
quadrupole: 0.3851 0.1034 0.6360
quadrupole: -1.1696 -0.3240 1.4936 0.3851 0.1034 0.6360
hfenergy: -511.4497227 hartree
pointgroup: C01 [X(C13H28)]
dipole: -0.0230733 -0.0042859 0.0189945 debye
polarizability: 180.8256079|-0.5534724|129.8987324|-0.129921|-0.8268943|118.6804263 unknown
InChI: InChI=1S/C13H28/c1-4-6-7-8-9-10-11-12-13(3)5-2/h13H,4-12H2,1-3H3
charge 0 multiplicity 1
41 atoms
C  -4.271801 -0.417714 0.236958
C  -2.955083 0.176985 -0.331777
C  -1.660381 -0.492994 0.185029
C  -0.379886 0.237849 -0.279813
C  0.923379 -0.436859 0.204064
C  2.200969 0.313503 -0.235605
C  -5.51606 0.397843 -0.215866
C  3.506086 -0.367487 0.234791
C  -4.444421 -1.904975 -0.158646
C  4.782231 0.394528 -0.188693
C  -5.579235 1.843723 0.325852
C  6.08823 -0.291254 0.273648
C  7.357173 0.481361 -0.147621
H  -4.21791 -0.360243 1.347122
H  -2.984297 0.112561 -1.441059
H  -2.906552 1.256478 -0.083236
H  -1.681642 -0.521506 1.295219
H  -1.615227 -1.547579 -0.153435
H  -0.406166 1.286912 0.083324
H  -0.372833 0.294769 -1.388728
H  0.906768 -0.513565 1.311629
H  0.960325 -1.4787 -0.178101
H  2.16788 1.351836 0.156401
H  2.21202 0.400707 -1.342425
H  -5.547785 0.414439 -1.325727
H  -6.426903 -0.14447 0.110993
H  3.489363 -0.466863 1.340578
H  3.545846 -1.401219 -0.168611
H  -5.392597 -2.312819 0.23969
H  -4.467418 -2.013862 -1.260967
H  -3.621858 -2.533965 0.225747
H  4.746636 1.425982 0.220952
H  4.797406 0.500651 -1.293883
H  -5.531355 1.852908 1.431668
H  -4.745934 2.4636 -0.051541
H  -6.521626 2.338199 0.025617
H  6.125211 -1.319744 -0.140316
H  6.070275 -0.401684 1.377322
H  7.413765 0.579383 -1.248381
H  7.358627 1.502272 0.279233
H  8.276578 -0.029189 0.193893
