program: Gaussian 09
title: 000028443
version: EM64L-G09RevD.01
frameworkgroup: C1[X(C12H16N2O)]
method: RPBEPBE
basis: SDD
operation: Freq
keyword: #p
keyword: freq=noraman
keyword: PBEPBE/SDD
title: #p freq=noraman PBEPBE/SDD
converged: YES YES NO NO
title: Mulliken charges:
elementType: O N N C C C C C C C C C C C C H H H H H H H H H H H H H H H H
charge: -0.271790 -0.402518 -0.572638 0.394843 -0.547731 0.143075 -0.367561 0.213048 -0.445190 -0.571212 -0.375274 -0.322666 0.307421 -0.348066 -0.536990 0.204055 0.198253 0.232817 0.199294 0.266612 0.301238 0.244896 0.172758 0.205593 0.227028 0.246091 0.271903 0.259591 0.241079 0.215010 0.217030
chargesum: 0.00000
title: Mulliken charges with hydrogens summed into heavy atoms:
elementType: O N N C C C C C C C C C C C C
charge: -0.271790 -0.101280 -0.041144 0.394843 -0.145423 0.143075 0.064550 0.213048 -0.178578 -0.326316 0.003077 -0.095638 0.307421 -0.101975 0.136129
polarizability: 1.79243691e+02 -1.18984441e+01 1.77032920e+02 1.47543859e+01 3.28151803e+00 8.89350690e+01
1716.lowfreq: -8.6080 -0.0005 -0.0002 0.0003 8.4217 10.4270 29.1724 45.4929 60.6190
frequency: 29.1044 45.2893 60.6057 90.9190 116.2987 149.7935 169.2451 173.5343 224.2260 243.7840 245.8744 271.9780 319.0949 374.8478 384.6063 425.7621 448.5538 477.9873 490.0640 507.1243 572.5714 581.5652 596.7814 648.6558 688.6434 743.5960 756.7243 760.2106 791.7584 803.8655 812.4288 841.0930 852.6127 907.1851 933.2258 956.9873 996.9050 1019.6414 1040.3968 1068.7578 1092.6512 1104.6517 1115.1099 1120.6558 1133.9315 1156.6463 1192.0192 1211.6698 1237.0860 1247.0335 1265.9228 1282.5754 1290.4100 1300.9282 1321.8347 1342.5350 1387.3274 1395.6735 1422.2632 1438.4920 1462.0962 1464.5710 1466.8128 1476.1932 1477.4532 1479.2601 1492.9769 1561.2190 1594.6853 1632.8625 1636.2842 2850.6417 2947.9165 2959.1098 2974.9163 3004.4069 3014.4521 3030.3404 3057.8641 3116.7340 3134.4233 3153.4890 3169.7092 3218.3201 3456.1757 3584.9299 3616.8195
redmass: 3.7728 1.9280 3.0957 3.4892 2.6776 3.9378 2.6375 3.3324 1.5751 1.8536 1.2200 3.3420 4.2526 4.8625 4.7834 2.7750 3.4032 2.3448 1.6201 3.9119 3.4389 1.4167 2.6599 3.5319 4.6198 2.5389 1.5126 2.7524 1.5941 1.5297 4.2680 1.6646 1.3970 4.6444 1.3296 1.8874 4.2944 3.6319 2.3845 2.2868 1.7069 1.9781 1.2627 1.5177 1.2546 1.3783 2.9111 1.4131 1.6707 1.9470 1.4177 1.0873 1.3528 2.3730 1.8375 1.4865 1.4621 5.2814 1.9150 1.5151 2.7604 1.0501 1.1336 1.1788 1.1982 2.6992 1.0915 6.3119 6.4377 7.0205 1.0966 1.0717 1.0335 1.0614 1.0670 1.0846 1.0958 1.1033 1.1012 1.0985 1.0893 1.0906 1.0955 1.0981 1.0447 1.0978 1.0809
irintensity: 0.5682 3.6973 2.0189 9.8932 0.7806 0.0823 4.8994 4.5465 26.4890 33.0757 1.6941 2.2687 8.9797 4.6357 4.2523 6.4501 4.5519 34.0159 95.8195 1.7516 16.3939 199.6875 19.2532 7.4037 11.6060 2.4273 3.6272 3.1169 61.5576 16.5849 11.5898 33.8388 0.6378 18.6884 0.0050 1.3517 38.4895 5.7481 13.7072 4.3648 17.1605 11.5669 0.2365 41.2138 4.0093 0.0592 141.1275 1.6004 8.1517 27.9613 0.8004 1.8086 9.5749 17.5311 12.6593 0.8611 18.7927 20.5174 33.5380 10.8639 54.8561 12.2759 1.6002 12.4394 2.7416 89.6918 6.2468 2.2367 23.9485 29.2297 41.9045 119.9432 59.6227 39.0308 21.5655 47.5412 16.8367 56.6307 57.5584 31.2165 13.6308 10.6899 9.3206 1.5344 1.7117 0.1207 62.1975
temp: 298.150 k
press: 1.00000 atm
elementType: 8 7 7 6 6 6 6 6 6 6 6 6 6 6 6 1 1 1 1 1 1 1 1 1 1 1 1 1 1 1 1
symmnumber: 1
zpe: 680175.0 jmol-1
zpe.correction: 0.259065 hartree
zpe.thermalcorrener: 0.274039 hartree
zpe.thermalcorrenthalpy: 0.274983 hartree
zpe.thermalcorrgfe: 0.216130 hartree
zpe.sumelectzpe: -650.467966 hartree
zpe.sumelectthermal: -650.452992 hartree
zpe.sumelectthermalent: -650.452048 hartree
zpe.sumelectthermalfe: -650.510902 hartree
dipole: 1.2817 -0.3643 0.8576
dipole: 1.5846
quadrupole: -90.9246 -65.6426 -95.5244
quadrupole: 9.9179 6.1834 2.9739
quadrupole: -6.8940 18.3879 -11.4939 9.9179 6.1834 2.9739
hfenergy: -650.7270313 hartree
pointgroup: C01 [X(C12H16N2O1)]
dipole: 0.5063062 0.1106855 -0.3464811 debye
polarizability: 179.958845|11.3377866|176.1244972|-15.9563429|1.2812061|89.1283382 unknown
InChI: InChI=1S/C12H16N2O/c1-15-10-4-5-12-11(7-10)9(8-14-12)3-2-6-13/h4-5,7-8,14H,2-3,6,13H2,1H3
charge 0 multiplicity 1
31 atoms
O  -2.788828 -2.26983 0.122811
N  -0.533574 2.843573 0.087464
N  4.767547 -1.740365 0.943599
C  0.928369 1.185444 -0.516631
C  2.186362 0.459491 -0.927969
C  -0.361507 0.585271 -0.215521
C  2.887882 -0.274132 0.249043
C  -1.256684 1.645467 0.159673
C  0.778156 2.560518 -0.321952
C  -0.835874 -0.757287 -0.241522
C  4.117752 -1.083904 -0.208034
C  -2.603349 1.398692 0.511699
C  -2.180392 -0.995511 0.1075
C  -3.056141 0.069844 0.483771
C  -1.959135 -3.40708 -0.263333
H  2.902937 1.174503 -1.378332
H  1.949221 -0.282313 -1.719426
H  3.206039 0.457738 1.014043
H  2.160656 -0.950836 0.743528
H  1.512037 3.355483 -0.445089
H  -0.903325 3.769437 0.287785
H  -0.164893 -1.571329 -0.531844
H  3.796872 -1.792016 -1.014593
H  4.852875 -0.394361 -0.668045
H  -3.283591 2.208375 0.798157
H  -4.087954 -0.18272 0.745741
H  5.672314 -2.173955 0.737882
H  4.148864 -2.368902 1.465873
H  -2.616819 -4.286298 -0.190009
H  -1.095724 -3.530682 0.421124
H  -1.589491 -3.304516 -1.303491
