program: Gaussian 09
title: 000028422
version: EM64L-G09RevD.01
frameworkgroup: C1[X(C14H6N4)]
method: RPBEPBE
basis: SDD
operation: Freq
keyword: #pfreq=noraman
keyword: PBEPBE/SDD
title: #p freq=noraman PBEPBE/SDD
converged: YES YES NO NO
title: Mulliken charges:
elementType: N N N N C C C C C C C C C C C C C C H H H H H H
charge: 0.023669 0.004698 0.022332 0.001603 0.473086 0.497892 -0.494509 -0.317163 -0.413091 -0.251390 -0.336244 -0.344042 0.291149 0.292427 -0.239887 -0.258127 -0.241139 -0.248538 0.254631 0.264566 0.247089 0.250666 0.264751 0.255571
chargesum: 0.00000
title: Mulliken charges with hydrogens summed into heavy atoms:
elementType: N N N N C C C C C C C C C C C C C C
charge: 0.023669 0.004698 0.022332 0.001603 0.473086 0.497892 -0.239878 -0.052597 -0.166002 -0.000723 -0.071493 -0.088471 0.291149 0.292427 -0.239887 -0.258127 -0.241139 -0.248538
polarizability: 3.47514750e+02 3.24060176e-01 2.10069109e+02 -5.75231124e-03 2.46116976e-02 6.52530238e+01
1716.lowfreq: -0.0008 0.0006 0.0008 1.6185 6.4616 7.5918 24.1721 28.3155 60.5509
frequency: 24.1142 28.2790 60.5509 79.1801 90.7892 116.7451 125.7386 138.2061 172.7978 207.7860 209.8337 237.4896 309.3599 322.2396 348.7773 372.9565 416.3486 428.6316 437.7239 448.1526 482.2556 594.6035 596.2776 602.4736 621.6077 628.0999 657.5904 661.0922 689.1782 764.1871 768.9371 816.6349 818.7180 907.7412 926.8628 963.1010 968.7202 974.2668 986.1256 1007.4419 1111.6160 1147.5063 1152.0255 1197.7473 1205.6982 1266.5881 1333.4328 1361.1451 1371.0179 1404.0928 1433.6932 1481.8150 1573.3260 1588.8135 1590.7620 1604.6005 2167.5674 2168.1222 2179.1792 2179.9908 3121.4511 3121.9815 3135.2320 3164.6936 3171.4208 3192.6095
redmass: 10.1422 10.8613 11.6602 5.1406 6.2475 10.5472 13.2596 11.9829 10.4047 8.0252 6.5137 7.8202 3.9049 3.8559 8.7511 6.0238 4.1982 9.4481 10.4026 9.8326 4.9193 12.0975 12.2149 5.0386 7.4696 7.4050 6.8803 5.4503 1.7158 7.8330 6.4392 6.5021 1.5080 1.4451 1.3650 1.5209 1.5980 3.3794 6.1462 1.3971 1.9496 4.5133 3.7098 1.6853 1.1676 2.8747 1.6394 1.8340 1.9338 3.0055 2.5609 2.3252 5.2770 6.2632 5.9164 5.5988 12.6196 12.6217 12.6368 12.6384 1.0898 1.0897 1.0898 1.0934 1.0915 1.0955
irintensity: 4.3422 0.0585 2.8901 1.9028 0.0004 1.3962 3.7484 8.0795 0.0308 10.6438 1.4080 0.0113 0.0586 0.5161 1.0042 0.2987 3.1364 0.0011 5.1544 1.1876 2.9342 0.7260 1.1156 0.1220 17.6723 9.0870 2.6373 0.0956 39.6492 2.8987 0.0584 1.5568 23.3289 0.0794 2.4701 2.0749 46.0625 1.5507 1.1120 0.9401 2.8717 3.6301 6.5126 27.8793 30.4039 12.4930 2.1154 9.0438 3.9004 10.3962 32.0676 13.7973 32.9586 33.7360 100.0878 8.1103 3.4619 4.6214 37.0329 15.7280 5.5164 5.9964 3.5693 8.6899 3.9814 4.4246
temp: 298.150 k
press: 1.00000 atm
elementType: 7 7 7 7 6 6 6 6 6 6 6 6 6 6 6 6 6 6 1 1 1 1 1 1
symmnumber: 1
zpe: 415329.9 jmol-1
zpe.correction: 0.158191 hartree
zpe.thermalcorrener: 0.174198 hartree
zpe.thermalcorrenthalpy: 0.175142 hartree
zpe.thermalcorrgfe: 0.112504 hartree
zpe.sumelectzpe: -754.811510 hartree
zpe.sumelectthermal: -754.795503 hartree
zpe.sumelectthermalent: -754.794559 hartree
zpe.sumelectthermalfe: -754.857197 hartree
dipole: -1.6280 -5.6792 0.0045
dipole: 5.9079
quadrupole: -157.5357 -109.7190 -103.7333
quadrupole: 5.4548 0.0194 0.0021
quadrupole: -33.8730 13.9437 19.9294 5.4548 0.0194 0.0021
hfenergy: -754.9697008 hartree
pointgroup: C01 [X(C14H6N4)]
dipole: 0.8901455 1.9328118 -0.9351574 debye
dipolederiv: -0.2610951 -0.0176541 0.003033 -0.1136992 -0.2082181 -0.017738 0.0552615 -0.0051589 -0.2029077 -0.2893119 -0.0209646 0.0021914 0.0929022 -0.1712572 -0.013694 -0.0598823 -0.028576 -0.2110848 -0.3495323 0.0485136 -0.0435953 -0.0022382 -0.1871793 -0.0152075 -0.0160245 -0.0087402 -0.2119236 -0.1511417 -0.0202018 0.0193912 0.1265357 -0.2451337 0.0316976 -0.0603158 0.0129283 -0.2313782 -0.3001632 -0.0137441 -0.0326414 -0.0337884 -0.19967 0.1125358 -0.0201795 0.1154422 -0.0501421 -0.3960939 0.079237 -0.0976455 -0.0300129 -0.0875392 0.0620131 -0.0391085 0.0760505 -0.0127281 0.2393771 0.0053828 0.0408278 0.0116825 -0.0744396 -0.0151848 0.0377151 -0.0157665 -0.0909018 -0.079993 0.0149751 -0.0086547 0.135524 0.0375965 -0.0465213 -0.0747451 -0.0621122 -0.0553132 0.062624 0.1009736 -0.0316314 -0.2367734 0.0482965 -0.1236275 0.1524319 -0.0805356 -0.0599972 -0.4599583 -0.0701456 -0.0044196 -0.0997733 0.150293 -0.1628882 0.0121776 -0.1593522 -0.0378749 0.9168924 0.1732491 0.0299235 0.4441851 0.0878882 -0.0187667 -0.1183594 -0.0535482 -0.0365173 0.8095752 -0.3396221 0.2951429 -0.393524 0.2331443 -0.2094153 0.3239105 -0.2023293 0.0913316 -0.4517641 -0.1638469 0.012557 0.0280339 0.2403776 -0.0470851 -0.0930945 -0.0720349 0.1743029 -0.0269722 0.1304128 -0.0929975 0.5102951 -0.0311468 0.162309 -0.2990524 0.1137404 0.0481755 0.1246049 0.1546922 -0.073066 0.2402962 0.0503171 0.0258594 -0.1189291 0.0150135 0.0164794 0.1022526 -0.0487714 0.032694 -0.2723836 0.0021792 -0.0061651 0.1546284 0.0227082 0.0633064 0.3389608 -0.1084933 0.0973983 -0.0761088 -0.070364 0.0493664 0.0795282 0.0454248 0.0237255 -0.1625125 0.1212714 -0.0941267 -0.1195209 0.1659281 -0.0741611 0.0366979 -0.043453 0.0858707 0.1308326 -0.0310679 0.0157194 -0.0410743 0.0310741 0.0542439 0.021145 0.0555272 0.1125313 0.0660135 0.0374785 -0.0303908 0.0293422 0.1037702 0.0271167 -0.0261809 0.028231 0.1279243 -0.0282109 -0.0936044 0.0280501 -0.0615664 0.0756407 0.0340528 0.0107159 0.0299709 0.1375552 0.0705085 0.0203003 -0.0223491 0.0046091 -0.0189819 0.0977477 -0.0137121 0.0997674 0.103671 0.0818137 0.058653 -0.039029 -0.0348846 0.0250831 0.0562148 0.0119542 0.0680636 0.1007217 0.0132937 -0.0170231 -0.0063818 -0.1080581 0.0423413 0.0372976 0.0434179 0.0487392 0.1151735 unknown
polarizability: 342.2451697|1.2663415|177.7240769|34.685565|-61.0121376|102.8676358 unknown
InChI: InChI=1S/C14H6N4/c15-7-13(8-16)5-11-2-1-3-12(4-11)6-14(9-17)10-18/h1-6H
charge 0 multiplicity 1
24 atoms
N  -5.042677 -2.185715 0.826227
N  -4.723033 1.713507 -1.256235
N  5.948334 -0.52795 1.327691
N  1.96916 -2.443657 1.860813
C  -1.022027 0.595039 -0.16997
C  1.424554 1.016282 -0.089172
C  0.293386 0.206941 0.208585
C  -1.201132 1.831677 -0.865418
C  1.208223 2.244804 -0.785406
C  -0.088921 2.641409 -1.165416
C  -2.100354 -0.327641 0.193953
C  2.807842 0.693259 0.262029
C  -3.466198 -0.249729 -0.025755
C  3.34461 -0.399613 0.924692
C  -4.325912 -1.30976 0.439952
C  -4.137964 0.830055 -0.700529
C  4.767689 -0.470225 1.145355
C  2.584806 -1.511207 1.432642
H  0.421592 -0.739568 0.740926
H  -2.196036 2.162481 -1.171136
H  2.065701 2.8847 -1.025156
H  -0.236295 3.585737 -1.697952
H  -1.772507 -1.229941 0.72834
H  3.545459 1.444215 -0.052658
