program: Gaussian 09
title: 000028419
version: EM64L-G09RevD.01
frameworkgroup: C1[X(C18H14N2O2)]
method: RPBEPBE
basis: SDD
operation: Freq
keyword: #p
keyword: freq=noraman
keyword: PBEPBE/SDD
title: #p freq=noraman PBEPBE/SDD
converged: YES YES NO NO
title: Mulliken charges:
elementType: O O N N C C C C C C C C C C C C C C C C C C H H H H H H H H H H H H H H
charge: -0.256133 -0.256191 -0.061357 -0.061288 0.053568 0.053581 0.207764 0.207782 0.472113 0.472116 -0.537246 -0.537248 0.207447 0.207388 -0.354663 -0.354671 -0.332033 -0.332027 -0.320888 -0.320824 -0.817071 -0.817071 0.260635 0.260638 0.254770 0.254765 0.235474 0.235469 0.293600 0.293620 0.232055 0.232212 0.229724 0.229723 0.232204 0.232061
chargesum: 0.00000
title: Mulliken charges with hydrogens summed into heavy atoms:
elementType: O O N N C C C C C C C C C C C C C C C C C C
charge: -0.256133 -0.256191 -0.061357 -0.061288 0.053568 0.053581 0.207764 0.207782 0.472113 0.472116 -0.276610 -0.276610 0.207447 0.207388 -0.099892 -0.099906 -0.096560 -0.096557 -0.027288 -0.027204 -0.123081 -0.123083
polarizability: 6.40489252e+02 -1.02276781e+01 1.96103052e+02 -9.31761874e-03 -1.67670241e-02 9.19023867e+01
1716.lowfreq: -5.9529 -0.0011 -0.0006 0.0013 0.4012 3.5781 25.9055 32.7231 34.2923
frequency: 25.9055 32.7231 34.2923 61.4407 63.2838 74.5109 111.1734 140.6777 151.8113 192.0500 219.3751 242.7669 264.5719 277.5892 308.5595 309.6718 366.2059 375.8445 387.3174 435.1148 442.3458 442.9895 456.6826 484.3093 534.9537 591.2137 592.6992 594.3577 607.7590 649.6030 697.0133 697.7164 728.6222 752.2441 752.3176 757.0245 784.6044 811.5090 811.9107 821.8619 822.6959 851.2538 884.9153 891.3130 891.6389 906.8170 931.6809 950.8958 950.9229 951.6289 981.0835 1003.1197 1003.5104 1049.7169 1049.7407 1064.8347 1093.9175 1116.8012 1121.6605 1146.0948 1149.4900 1188.7462 1195.0805 1253.6908 1253.7626 1275.9197 1276.6140 1280.9452 1317.1166 1380.9308 1381.9911 1402.2900 1402.2957 1421.5743 1426.5258 1460.4053 1460.5217 1471.6178 1471.6247 1485.9416 1486.1968 1494.3756 1542.5040 1598.5199 1607.3971 1622.1569 1624.4464 1641.6130 2979.2128 2979.2804 3056.9690 3056.9755 3088.9167 3088.9193 3133.3955 3133.4172 3155.0402 3161.8273 3161.8623 3164.0488 3177.4727 3177.5308
redmass: 5.0854 5.3151 4.7223 1.1706 1.0493 3.7239 5.8906 4.2982 3.4946 7.0051 5.7825 3.3436 3.6042 3.6356 5.0929 3.1680 4.3088 3.7596 5.0636 3.0072 5.8233 3.4605 5.2227 6.0299 5.6807 3.3865 5.5756 3.3373 6.3673 6.7870 7.2041 10.4693 6.4262 4.9110 4.8423 6.2409 5.6102 1.3468 1.3487 7.6422 7.0697 13.5599 1.9286 1.3835 1.4040 4.7093 2.9499 1.3373 1.3373 3.5436 1.0889 1.4969 1.5495 1.5365 1.5364 4.1576 2.3615 2.2695 2.0468 2.3258 2.2603 1.7777 2.2205 4.5586 3.7238 1.4962 1.4955 1.4114 2.1602 4.3955 4.2271 1.2499 1.2520 4.1530 4.2188 1.9689 1.9613 1.0451 1.0451 1.5235 1.4538 6.5059 9.3392 7.1721 8.1253 7.1971 7.5870 6.7696 1.0376 1.0376 1.0977 1.0977 1.0986 1.0986 1.0897 1.0897 1.0964 1.0931 1.0931 1.0866 1.0960 1.0960
irintensity: 0.8037 0.6128 1.1988 0.0000 0.6166 0.0000 0.0000 3.3364 0.0000 0.0000 0.0738 0.0000 3.7286 0.0000 0.0001 0.0000 0.0000 12.5030 9.2534 0.0000 7.8943 8.6729 0.0000 0.0000 1.7360 0.0003 17.2658 17.5055 0.0000 0.0000 0.4106 4.8852 0.0001 0.1037 0.0000 6.4581 0.0001 0.0285 105.8414 0.0417 49.9331 85.3140 0.0000 18.0726 0.0012 0.0001 20.1563 0.1369 3.6559 0.0002 63.5279 57.6567 0.0038 0.0418 24.7383 0.0001 14.9763 16.6543 0.0000 0.0001 15.2606 22.1773 0.0003 0.0002 0.0245 0.0001 7.8135 0.0000 76.3521 0.0000 40.4239 1.6025 25.5550 0.0001 26.4450 10.6629 0.0068 0.7036 26.8422 0.0012 35.8626 0.0002 128.4578 0.0000 7.0462 0.0000 11.1810 0.0000 95.6092 0.0059 1.7242 38.4814 24.9061 6.4893 21.9033 4.6471 0.0000 15.8442 0.1790 11.9418 20.7019 0.0254
temp: 298.150 k
press: 1.00000 atm
elementType: 8 8 7 7 6 6 6 6 6 6 6 6 6 6 6 6 6 6 6 6 6 6 1 1 1 1 1 1 1 1 1 1 1 1 1 1
symmnumber: 1
zpe: 716802.5 jmol-1
zpe.correction: 0.273016 hartree
zpe.thermalcorrener: 0.291495 hartree
zpe.thermalcorrenthalpy: 0.292439 hartree
zpe.thermalcorrgfe: 0.224234 hartree
zpe.sumelectzpe: -952.743664 hartree
zpe.sumelectthermal: -952.725185 hartree
zpe.sumelectthermalent: -952.724241 hartree
zpe.sumelectthermalfe: -952.792446 hartree
dipole: 0.0007 -0.0002 -0.0004
dipole: 0.0008
quadrupole: -73.1396 -121.7513 -132.3294
quadrupole: -2.3721 0.0098 0.0012
quadrupole: 35.9338 -12.6778 -23.2560 -2.3721 0.0098 0.0012
hfenergy: -953.01668 hartree
pointgroup: C01 [X(C18H14N2O2)]
dipole: 0.0002595 0.0000938 0.000141 debye
polarizability: 640.6808461|4.1067428|195.7774713|-1.7454845|-3.6651282|92.0363739 unknown
InChI: InChI=1S/C18H14N2O2/c1-11-3-5-15-13(9-11)19-17(21-15)7-8-18-20-14-10-12(2)4-6-16(14)22-18/h3-10H,1-2H3
charge 0 multiplicity 1
36 atoms
O  2.703274 1.483248 -0.056339
O  -2.700566 -1.47389 0.062638
N  2.580241 -0.84056 0.025084
N  -2.577907 0.849954 -0.020478
C  3.937442 -0.448724 0.007347
C  -3.93503 0.457878 -0.002498
C  4.017059 0.974669 -0.042461
C  -4.014363 -0.965497 0.048362
C  6.362743 -0.550386 0.003099
C  -6.360337 0.559171 0.001642
C  5.119379 -1.222496 0.030413
C  -5.117077 1.231455 -0.026155
C  1.879815 0.295787 -0.0127
C  -1.877204 -0.286146 0.018004
C  5.229001 1.674508 -0.07062
C  -5.226222 -1.665481 0.077025
C  6.398045 0.881468 -0.046813
C  -6.395394 -0.872649 0.052608
C  0.457507 0.518425 -0.016533
C  -0.454906 -0.508706 0.021893
C  7.668196 -1.327708 0.025697
C  -7.665911 1.336273 -0.021487
H  5.063989 -2.314496 0.068074
H  -5.061848 2.323435 -0.064601
H  5.270987 2.76587 -0.108807
H  -5.268047 -2.756821 0.116017
H  7.374185 1.380507 -0.067502
H  -7.371449 -1.371844 0.073656
H  0.117512 1.558749 -0.051955
H  -0.114874 -1.549016 0.05735
H  8.278434 -1.11397 -0.871841
H  8.280456 -1.059097 0.907057
H  7.491116 -2.415887 0.059586
H  -7.489001 2.424443 -0.056549
H  -8.278326 1.066649 -0.902427
H  -8.275916 1.123383 0.876413
