program: Gaussian 09
title: 000028423
version: EM64L-G09RevD.01
frameworkgroup: C1[X(C11H13NO4)]
method: RPBEPBE
basis: SDD
operation: Freq
keyword: #p
keyword: freq=noraman
keyword: PBEPBE/SDD
title: #p freq=noraman PBEPBE/SDD
converged: YES YES NO NO
title: Mulliken charges:
elementType: O O O O N C C C C C C C C C C C H H H H H H H H H H H H H
charge: -0.260353 -0.236979 -0.255916 -0.267816 -0.450441 0.486829 0.335956 -0.317967 -0.435956 -0.401318 -0.293127 0.220025 -0.236653 -0.669212 0.281531 -0.780676 0.314801 0.220566 0.262917 0.302375 0.302732 0.232336 0.232108 0.235234 0.235188 0.212582 0.259381 0.259393 0.212461
chargesum: 0.00000
title: Mulliken charges with hydrogens summed into heavy atoms:
elementType: O O O O N C C C C C C C C C C C
charge: -0.260353 -0.236979 -0.255916 -0.267816 -0.147709 0.486829 0.335956 -0.003166 -0.215390 -0.138401 0.009248 0.220025 0.227791 0.013791 0.281531 -0.049441
polarizability: 2.55343323e+02 -2.52322648e+00 1.32882687e+02 6.68401460e-02 6.01044558e-03 7.13380226e+01
1716.lowfreq: -4.9684 -0.0006 0.0004 0.0006 2.0322 7.8166 24.7451 27.0609 50.9330
frequency: 23.8650 26.8171 50.9098 57.0638 70.0987 71.5328 84.5604 133.0947 143.3369 190.6123 201.1462 249.0648 260.8560 314.6504 347.6248 377.2339 380.3721 406.6465 416.3872 521.0534 521.5871 595.3611 619.6753 634.8482 642.6909 681.6616 687.1294 719.9137 762.6033 800.7872 826.4039 830.2596 837.6384 860.2827 932.7410 960.9674 967.4057 991.4593 992.0852 1006.1060 1035.5617 1039.9423 1114.0429 1121.4814 1137.5505 1163.3841 1171.4635 1202.0901 1217.2707 1251.9241 1268.3051 1304.3259 1359.6387 1372.2508 1388.5477 1403.2141 1414.7130 1448.2793 1461.7745 1469.8192 1473.6464 1486.7390 1490.7394 1505.2637 1594.5361 1620.4463 1622.3538 1626.7622 2995.0803 2999.2411 3011.9664 3072.9123 3095.8937 3096.8927 3098.8437 3112.7149 3119.1807 3168.0440 3198.6148 3204.1404 3535.4376
redmass: 3.0727 5.2830 1.4457 2.3255 4.5591 4.3983 2.9113 3.2021 5.0422 5.9420 5.1211 1.2427 4.5036 8.7252 4.3755 5.4505 4.3448 4.0950 3.1030 2.5790 4.5049 3.2445 7.0550 5.9155 1.1844 11.7824 8.7074 3.6031 6.4617 1.0971 4.3542 1.3614 5.0437 1.4959 6.4382 1.3169 4.7821 1.3137 1.6628 2.5333 2.9675 1.6306 2.2839 1.3010 1.4601 2.5661 3.4644 1.5621 3.4482 1.1311 2.0382 1.4085 1.3692 5.9784 1.2224 1.2675 3.9663 1.0451 1.0395 1.0953 1.0596 1.0817 2.2467 2.4440 6.7949 6.3856 8.5209 5.4222 1.0363 1.0361 1.0580 1.1073 1.0984 1.1006 1.0979 1.1027 1.0908 1.0910 1.0955 1.0943 1.0765
irintensity: 3.1653 0.0278 2.4755 1.1419 6.8042 2.0714 1.3375 2.4253 7.2859 0.5630 0.0048 0.5809 0.7473 18.2238 6.4328 1.0886 1.6865 15.8247 0.0753 32.4738 7.8365 0.1877 1.1623 0.9050 58.7999 19.3905 3.1520 0.1886 22.2023 3.7684 21.9276 31.7069 2.7425 85.4726 6.4076 0.6049 5.0374 2.3114 11.1147 51.0252 144.9579 15.0430 38.1157 23.3818 5.8639 417.9965 1318.2374 64.6137 98.4446 0.0069 4.0013 15.7718 12.1149 179.5303 45.8994 22.6804 16.7212 15.4109 12.3785 20.4890 7.2844 19.2325 68.9478 481.9754 45.8816 8.5966 328.2519 22.2318 13.9497 19.2842 22.2828 9.0704 27.6192 20.4383 7.0471 40.5552 18.9588 1.7202 9.3121 2.7810 11.9813
temp: 298.150 k
press: 1.00000 atm
elementType: 8 8 8 8 7 6 6 6 6 6 6 6 6 6 6 6 1 1 1 1 1 1 1 1 1 1 1 1 1
symmnumber: 1
zpe: 590199.0 jmol-1
zpe.correction: 0.224795 hartree
zpe.thermalcorrener: 0.241216 hartree
zpe.thermalcorrenthalpy: 0.242160 hartree
zpe.thermalcorrgfe: 0.178004 hartree
zpe.sumelectzpe: -781.443380 hartree
zpe.sumelectthermal: -781.426959 hartree
zpe.sumelectthermalent: -781.426015 hartree
zpe.sumelectthermalfe: -781.490171 hartree
dipole: -0.5020 3.5555 -0.0130
dipole: 3.5908
quadrupole: -64.5653 -95.5216 -95.1744
quadrupole: 17.9272 -0.0733 -0.0209
quadrupole: 20.5218 -10.4345 -10.0873 17.9272 -0.0733 -0.0209
hfenergy: -781.6681751 hartree
pointgroup: C01 [X(C11H13N1O4)]
dipole: 0.172269 -1.1303478 -0.8297015 debye
polarizability: 255.1420408|-1.691261|111.7144398|-5.7025703|29.2988945|92.7075522 unknown
InChI: InChI=1S/C11H13NO4/c1-3-15-11(14)16-10-6-4-9(5-7-10)12-8(2)13/h4-7,12H,3H2,1-2H3
charge 0 multiplicity 1
29 atoms
O  1.933176 0.512857 0.213161
O  4.136235 0.418253 0.092806
O  -4.581828 1.264703 0.929377
O  2.926697 -1.228248 -1.057444
N  -3.62624 -0.456288 -0.352292
C  -2.232666 -0.199312 -0.199866
C  0.554446 0.182506 0.008654
C  -1.721335 0.881353 0.570209
C  -1.327737 -1.074309 -0.855476
C  -0.329533 1.062467 0.667386
C  0.067272 -0.897497 -0.761493
C  -4.706886 0.245289 0.188293
C  5.409118 -0.211021 -0.387534
C  6.544744 0.620564 0.195704
C  2.984321 -0.211259 -0.330498
C  -6.078957 -0.313695 -0.184497
H  -2.414084 1.555417 1.075793
H  -1.711853 -1.911984 -1.451912
H  0.086251 1.886712 1.253995
H  0.751934 -1.577039 -1.26974
H  -3.858942 -1.26279 -0.935654
H  5.428473 -1.260481 -0.042463
H  5.401873 -0.206292 -1.492445
H  6.484997 1.666518 -0.149368
H  6.51161 0.614805 1.298207
H  7.515204 0.201405 -0.126746
H  -6.659805 0.474927 -0.6931
H  -6.6224 -0.572532 0.740515
H  -6.042187 -1.20413 -0.83617
