program: Gaussian 09
title: 000028683
version: EM64L-G09RevD.01
frameworkgroup: C1[X(C20H28O6)]
method: RPBEPBE
basis: SDD
operation: Freq
keyword: #pfreq=noraman
keyword: PBEPBE/SDD
title: #p freq=noraman PBEPBE/SDD
converged: YES YES NO NO
title: Mulliken charges:
elementType: O O O O O O C C C C C C C C C C C C C C C C C C C C H H H H H H H H H H H H H H H H H H H H H H H H H H H H
charge: -0.459213 -0.456901 -0.451010 -0.467515 -0.196547 -0.433879 -0.403512 0.151485 0.303211 -0.156218 0.272684 -0.177337 -0.165664 -0.755831 -0.750883 -0.273256 -0.493643 0.114290 -0.797042 -0.584388 0.442660 -0.383843 -0.057484 0.312360 -0.528216 -0.797729 0.248011 0.308556 0.204361 0.284181 0.237854 0.206562 0.218226 0.212165 0.206698 0.244662 0.237864 0.220610 0.335354 0.265661 0.216195 0.233798 0.331401 0.346727 0.227021 0.262058 0.287622 0.363344 0.234376 0.195656 0.225129 0.247002 0.243452 0.348876
chargesum: 0.00000
title: Mulliken charges with hydrogens summed into heavy atoms:
elementType: O O O O O O C C C C C C C C C C C C C C C C C C C C
charge: -0.123859 -0.125500 -0.104283 -0.104171 -0.196547 -0.085003 -0.155501 0.151485 0.303211 0.152338 0.272684 0.027024 0.118517 -0.093189 -0.087358 -0.035392 -0.273033 0.114290 -0.081389 -0.095308 0.442660 -0.096221 -0.057484 0.312360 -0.098184 -0.082146
polarizability: 2.75577754e+02 -1.88936721e+00 2.26876074e+02 1.18350844e+01 5.35286308e+00 1.89152896e+02
1716.lowfreq: -2.9591 0.0002 0.0007 0.0008 5.4759 9.4203 40.6847 54.4285 58.0321
frequency: 40.4411 54.4133 58.0017 64.6762 75.9231 82.0777 93.2384 103.7504 121.6700 146.8172 154.1260 169.6765 175.0696 182.9530 196.6226 202.3006 215.4358 229.4464 244.1095 249.1343 253.8624 258.2640 277.0200 282.7678 291.8023 297.6574 305.5334 322.1061 322.5445 329.1900 342.6742 353.0822 361.7255 375.1362 377.7809 386.2666 392.1520 395.5785 413.5206 417.0861 485.7089 494.4291 520.8706 550.7015 555.3219 585.1039 596.2178 647.2820 671.1324 685.0740 692.8940 716.5170 725.8388 756.6293 772.6629 775.9931 832.6258 847.3973 879.5198 893.2105 906.6302 912.9287 918.1070 927.7961 942.9833 954.7118 957.9899 968.0598 971.1666 975.5066 981.6916 996.9084 1009.1967 1013.2916 1035.3741 1049.1188 1050.3565 1067.0990 1082.3419 1090.2727 1097.6121 1118.5971 1123.6792 1131.7964 1136.6281 1144.8839 1169.1001 1179.3872 1185.0888 1196.9886 1203.4071 1229.7399 1233.9893 1244.7483 1260.4985 1272.7217 1280.1827 1288.7115 1294.8897 1312.5826 1320.8138 1329.9264 1334.0284 1335.8236 1347.6933 1351.7473 1357.1984 1363.1255 1374.1564 1384.3500 1385.6348 1389.5694 1400.9158 1404.5144 1437.2101 1440.8555 1456.2754 1457.1349 1457.4874 1465.8285 1469.0571 1476.1093 1477.8295 1489.0547 1492.9217 1603.0342 1632.1492 1663.8715 2918.1007 2932.3450 2945.2410 2947.5636 2975.9411 2981.9341 2984.4702 2985.0732 2994.6049 3005.8126 3051.9636 3057.5889 3062.7003 3063.0529 3068.0920 3081.2125 3086.7647 3087.5935 3089.0314 3096.3803 3105.1240 3114.8823 3165.4133 3509.4445 3525.1418 3527.8623 3561.9482 3569.3654
redmass: 4.6216 4.4996 4.2075 4.5243 3.8429 1.3447 2.5852 2.9399 1.7817 1.6156 2.5116 3.4446 2.3311 3.1991 3.0929 3.6415 2.5132 3.2907 3.4878 3.4297 2.0601 2.0580 1.7131 2.2542 3.5511 1.8808 3.7711 2.3525 1.5955 2.0153 1.8765 2.3044 3.4552 3.5478 3.0980 2.6638 1.3161 1.5008 2.6223 2.1322 3.5607 4.0639 3.4970 4.2775 4.3753 4.3254 4.0094 5.1771 3.2109 3.7419 4.2397 4.3406 4.2721 4.4466 4.0762 4.2292 3.3417 2.7773 1.8701 2.1797 2.4454 3.0305 1.9853 2.7981 2.7875 2.1070 1.6679 2.1225 1.8566 2.6845 1.9465 2.4362 1.3457 2.0366 2.4565 1.6391 2.2802 4.0611 2.5734 2.0823 2.6620 1.8986 2.5104 2.1397 2.0346 2.2140 1.5242 2.0031 1.8760 1.5248 1.4663 1.4550 1.5407 1.5906 1.7315 1.6394 1.5090 1.4992 1.3319 1.2991 1.4950 2.4161 1.7400 1.5030 1.4694 1.4175 1.4945 1.4803 1.4009 1.2551 1.3097 1.4546 1.2724 1.2515 1.9281 1.0966 1.0444 1.0541 1.0884 1.0798 1.0468 1.0545 1.0876 1.0485 1.1703 9.6965 7.8116 7.7378 1.0795 1.0690 1.0829 1.0641 1.0375 1.0398 1.0368 1.0357 1.0813 1.0936 1.0833 1.0989 1.0966 1.0977 1.0899 1.0933 1.0978 1.0898 1.0989 1.1001 1.0970 1.0944 1.0956 1.0658 1.0656 1.0657 1.0659 1.0666
irintensity: 0.1797 1.3094 3.9188 0.7996 1.9397 1.7606 3.5491 0.3351 1.2175 0.9638 1.7373 0.3078 2.3945 3.6197 17.4659 7.9221 0.8159 4.3855 0.6990 0.5445 55.1416 35.8637 63.1868 6.4287 21.5795 10.4848 19.3505 16.5374 35.7805 52.2814 36.2677 21.9749 9.5408 10.6443 20.3573 4.1321 15.3782 216.6848 6.5123 83.9778 14.7933 1.5168 22.6595 14.5465 5.3112 6.1199 1.3489 4.4058 15.1097 4.7516 4.3780 3.8353 7.7019 6.9096 3.5050 8.8978 6.3041 21.8066 42.0580 43.0737 45.9413 8.1492 31.8269 45.5131 27.2558 23.8491 9.8965 52.4791 20.6354 58.0982 2.6777 16.3506 1.6472 40.7680 20.4085 6.6096 39.7088 19.5656 2.6579 6.0516 36.0823 9.3623 36.8826 2.7313 3.3901 16.9670 16.9259 15.3005 36.9770 79.7382 12.4501 36.5053 19.3056 42.9651 4.6266 4.8247 1.4999 34.2751 18.4554 17.8211 9.4635 13.0021 20.1239 1.3632 6.3117 3.2279 16.2277 4.8616 1.2956 11.9752 18.9722 29.1096 16.6669 12.2932 2.8972 6.3344 14.1848 2.5896 6.8770 7.8805 8.8283 10.2325 18.3263 8.3234 8.4413 241.8890 9.9728 2.2557 7.6725 57.0094 39.5853 30.1428 38.6189 54.3152 37.3129 11.2308 4.1919 7.8473 5.9481 10.2004 10.6534 47.5664 11.5803 21.8652 9.1993 21.3799 38.5245 12.9682 19.8135 27.0964 7.3227 12.5895 3.8023 2.2588 7.9374 12.3528
temp: 298.150 k
press: 1.00000 atm
elementType: 8 8 8 8 8 8 6 6 6 6 6 6 6 6 6 6 6 6 6 6 6 6 6 6 6 6 1 1 1 1 1 1 1 1 1 1 1 1 1 1 1 1 1 1 1 1 1 1 1 1 1 1 1 1
symmnumber: 1
zpe: 1165225.5 jmol-1
zpe.correction: 0.443811 hartree
zpe.thermalcorrener: 0.471388 hartree
zpe.thermalcorrenthalpy: 0.472332 hartree
zpe.thermalcorrgfe: 0.389173 hartree
zpe.sumelectzpe: -1228.169868 hartree
zpe.sumelectthermal: -1228.142291 hartree
zpe.sumelectthermalent: -1228.141347 hartree
zpe.sumelectthermalfe: -1228.224506 hartree
dipole: 1.6825 -0.2975 -3.5813
dipole: 3.9680
quadrupole: -161.2468 -165.8096 -148.9621
quadrupole: -3.5127 -6.5947 0.0041
quadrupole: -2.5740 -7.1368 9.7108 -3.5127 -6.5947 0.0041
hfenergy: -1228.6136791 hartree
pointgroup: C01 [X(C20H28O6)]
dipole: -0.6443507 -0.108951 1.4177783 debye
polarizability: 275.9659611|0.396092|226.8880281|10.4253964|-5.4119387|188.7527344 unknown
InChI: InChI=1S/C20H28O6/c1-9-5-13-18(24,15(9)22)7-11(8-21)6-12-14-17(3,4)20(14,26)16(23)10(2)19(12,13)25/h5-6,10,12-14,16,21,23-26H,7-8H2,1-4H3
charge 0 multiplicity 1
54 atoms
O  4.281541 -0.369103 1.145459
O  0.677989 -0.795418 2.069913
O  3.074123 -2.449826 -1.001167
O  -1.25321 -0.12846 -1.767612
O  -4.24805 -0.437079 -1.535658
O  -2.360064 4.633299 -0.021217
C  2.260057 0.969663 0.316001
C  3.128301 -0.291551 0.254417
C  3.273037 0.765326 -0.854445
C  0.748593 0.841836 0.127126
C  0.237621 -0.557277 0.665173
C  2.462452 -1.65678 0.088325
C  0.928683 -1.680466 -0.163094
C  2.775896 0.491593 -2.27229
C  4.521862 1.647831 -0.827274
C  -1.327042 -0.518368 0.686673
C  0.020915 2.063564 0.675551
C  -2.038153 0.128639 -0.533342
C  0.429388 -3.116142 0.112665
C  -2.315671 1.638726 -0.335868
C  -1.27451 2.431774 0.450318
C  -2.126895 -1.777739 0.961383
C  -3.340905 -0.714515 -0.698574
C  -3.278867 -1.87231 0.221359
C  -1.803362 3.741342 1.019908
C  -4.349464 -2.927012 0.262255
H  2.586344 1.706868 1.06212
H  0.512834 0.799445 -0.952855
H  2.636594 -2.183681 1.052635
H  0.740483 -1.456323 -1.22743
H  1.913682 -0.190031 -2.318537
H  2.492523 1.444806 -2.759341
H  3.57964 0.027759 -2.872539
H  5.345026 1.177667 -1.397541
H  4.300885 2.627289 -1.293065
H  4.883867 1.811264 0.200067
H  -1.535162 0.16225 1.543497
H  0.639038 2.765933 1.256522
H  3.945296 -0.582095 2.054682
H  1.100557 -3.826564 -0.400526
H  0.444701 -3.340227 1.194747
H  -0.591014 -3.277644 -0.274221
H  0.393021 -0.015886 2.614195
H  4.055097 -2.430734 -0.862472
H  -3.288163 1.739423 0.194053
H  -2.477501 2.101145 -1.330439
H  -1.828817 -2.481312 1.744224
H  -1.859582 0.031699 -2.539294
H  -0.985823 4.323652 1.475047
H  -2.576528 3.547144 1.797085
H  -4.163005 -3.6705 1.055125
H  -4.41121 -3.456561 -0.706693
H  -5.342461 -2.470742 0.429336
H  -3.251687 4.301109 -0.296266
