program: Gaussian 09
title: 000028375
version: EM64L-G09RevD.01
frameworkgroup: C1[X(C14H21BrN2O)]
method: RPBEPBE
basis: SDD
operation: Freq
keyword: #p
keyword: freq=noraman
keyword: PBEPBE/SDD
title: #p freq=noraman PBEPBE/SDD
converged: YES YES NO NO
title: Mulliken charges:
elementType: Br O N N C C C C C C C C C C C C C C H H H H H H H H H H H H H H H H H H H H H
charge: -0.001895 -0.248522 -0.299154 -0.473656 -0.367763 -0.349129 -0.342961 -0.478806 0.154192 0.355114 0.374466 0.188379 -0.689454 -0.377088 -0.364071 -0.829162 -0.816631 -0.213083 0.183589 0.212366 0.197623 0.176126 0.191071 0.192610 0.292469 0.218836 0.204791 0.307431 0.215089 0.211586 0.210356 0.256074 0.256744 0.225677 0.246530 0.241936 0.290371 0.225730 0.222220
chargesum: 0.00000
title: Mulliken charges with hydrogens summed into heavy atoms:
elementType: Br O N N C C C C C C C C C C C C C C
charge: -0.001895 -0.248522 -0.006685 -0.166225 0.028191 0.024621 0.040719 -0.055179 0.154192 0.355114 0.374466 0.188379 -0.052423 -0.121014 -0.107327 -0.115019 -0.078310 -0.213083
polarizability: 2.87138901e+02 5.15675403e+00 1.75744169e+02 8.18492335e+00 -5.97709123e-01 1.14240241e+02
1716.lowfreq: -0.0005 0.0003 0.0004 3.0302 5.7727 10.3519 16.5886 27.0741 48.5736
frequency: 15.7374 27.0261 48.4544 63.0089 82.2267 83.8137 92.3912 130.4997 139.8988 143.0085 150.9621 157.8412 174.6985 176.7147 185.5471 214.4514 230.8754 232.2803 259.9290 296.9803 312.0055 348.1667 365.1970 423.0651 451.6577 490.6632 514.1712 524.3365 530.4211 552.8292 581.0648 605.2169 673.2081 694.4558 716.3691 738.3233 776.8884 804.7615 844.7889 869.6146 879.3961 896.5368 925.9954 936.8047 958.5858 987.7575 995.6065 1026.6160 1040.0158 1045.1962 1051.4379 1052.7701 1081.4526 1109.3641 1126.2521 1144.6522 1167.1909 1191.7555 1197.9787 1225.5649 1234.7642 1246.1349 1266.1752 1277.4059 1283.1512 1285.5775 1317.4869 1349.4190 1363.9024 1382.2505 1395.2560 1398.4309 1401.7774 1406.9671 1440.1579 1449.9305 1458.7857 1467.2735 1469.1794 1470.0792 1475.4097 1475.5569 1478.5039 1481.7842 1487.0223 1487.5102 1497.7363 1584.8746 1594.9547 1634.4004 2809.3799 2832.4576 2961.4983 2962.3619 2965.9568 2968.0450 2974.4648 2982.6057 2984.9963 3007.3247 3041.5577 3044.8081 3066.9894 3071.4836 3073.1761 3094.0472 3094.7309 3158.8677 3162.2558 3427.9879 3509.5871
redmass: 5.3628 5.8267 4.9474 1.8392 3.8153 2.7114 3.9922 2.4222 1.7582 1.8303 2.8754 1.9098 2.4734 3.7561 1.8072 3.6147 2.0042 1.3055 4.5110 3.7378 3.6384 3.7655 5.3343 4.0078 3.0197 3.3364 3.0677 4.3828 4.0624 2.7667 1.6290 3.3184 1.4559 4.0812 3.9163 1.0736 4.6779 1.1575 5.5570 1.3656 1.3434 1.8491 4.3349 1.2315 2.9393 1.8416 1.5727 3.1406 1.6271 1.6789 2.2930 1.6741 2.2619 1.7909 2.2697 1.5037 3.4919 2.4840 1.5291 1.4543 1.9688 1.6242 1.3254 1.1768 2.6828 1.0713 1.3842 1.5815 5.9831 1.5279 1.2346 1.4971 1.2605 2.2511 2.0866 1.3361 1.1261 1.0937 1.0664 1.0787 1.0862 1.3776 1.0427 1.2569 1.0742 1.3936 1.0911 5.7009 7.5531 5.6803 1.0710 1.0715 1.0638 1.0833 1.0418 1.0647 1.0364 1.0806 1.0365 1.0983 1.1019 1.0932 1.0969 1.1006 1.0995 1.0982 1.0999 1.0926 1.0927 1.0740 1.0761
irintensity: 0.2840 0.1000 0.5192 1.4207 0.8382 3.8465 1.6093 1.4305 2.6454 1.4562 0.9157 1.9663 0.1069 4.7481 1.3492 8.7464 0.5581 0.4503 8.0196 2.9460 0.2946 5.5387 9.6294 4.6965 0.9663 3.9793 0.9328 3.2089 7.2419 34.6690 26.1024 29.9840 80.1810 9.7483 4.3933 10.2525 18.8585 3.4096 68.7834 21.4719 12.1759 4.6217 25.8795 1.1495 8.4174 2.8554 11.2360 1.1684 5.8691 2.3346 6.2115 15.7355 0.9092 2.3564 3.3351 5.7167 43.3640 1.9822 3.6995 15.7508 106.2098 69.8188 15.5015 1.5191 1.9593 0.3307 4.5455 4.6433 20.8955 24.2071 9.7773 40.6699 15.1086 12.8555 5.6921 279.1011 48.4927 14.4407 13.2412 2.2240 17.8595 73.6800 12.8898 39.5524 9.3513 145.0117 5.4867 30.9763 15.8192 122.3116 84.9382 132.2872 3.4991 47.2948 32.3746 43.0480 37.2561 69.3604 18.3601 3.7945 46.8727 18.1652 8.7269 85.9334 56.2699 18.6008 19.2791 4.7593 1.2347 17.6934 14.4066
temp: 298.150 k
press: 1.00000 atm
elementType: 35 8 7 7 6 6 6 6 6 6 6 6 6 6 6 6 6 6 1 1 1 1 1 1 1 1 1 1 1 1 1 1 1 1 1 1 1 1 1
symmnumber: 1
zpe: 852464.4 jmol-1
zpe.correction: 0.324687 hartree
zpe.thermalcorrener: 0.345390 hartree
zpe.thermalcorrenthalpy: 0.346334 hartree
zpe.thermalcorrgfe: 0.272751 hartree
zpe.sumelectzpe: -742.903687 hartree
zpe.sumelectthermal: -742.882983 hartree
zpe.sumelectthermalent: -742.882039 hartree
zpe.sumelectthermalfe: -742.955623 hartree
dipole: 2.1579 3.4930 1.8778
dipole: 4.5148
quadrupole: -125.0443 -108.3806 -121.8821
quadrupole: 1.8540 -0.5641 0.1898
quadrupole: -6.6086 10.0551 -3.4464 1.8540 -0.5641 0.1898
hfenergy: -743.2283736 hartree
pointgroup: C01 [X(C14H21Br1N2O1)]
dipole: 0.7777423 0.780783 1.3930567 debye
polarizability: 285.8210995|-0.6813206|159.1282179|17.1686769|27.3639181|132.1739925 unknown
InChI: InChI=1S/C14H21BrN2O/c1-4-5-6-16-9-13(18)17-14-10(2)7-12(15)8-11(14)3/h7-8,16-17H,4-6,9H2,1-3H3
charge 0 multiplicity 1
39 atoms
Br -6.467067 -0.425791 -0.969633
O  0.556286 -0.036934 -1.170812
N  2.980246 -0.135078 0.196723
N  -0.581507 0.311757 0.848738
C  5.412986 -0.445504 -0.200217
C  4.322739 0.401581 0.483563
C  6.840273 0.088823 0.054997
C  1.868811 0.605953 0.796545
C  -1.935087 0.120072 0.396363
C  -2.872232 1.16709 0.640898
C  -2.328052 -1.098657 -0.228822
C  0.56424 0.252699 0.060959
C  7.928427 -0.769463 -0.625497
C  -4.2171 0.993681 0.238789
C  -3.67936 -1.237776 -0.637572
C  -2.441727 2.459398 1.312028
C  -1.363089 -2.245123 -0.44123
C  -4.597318 -0.200093 -0.402401
H  5.223984 -0.472002 -1.294497
H  5.32751 -1.489368 0.159341
H  4.482716 0.383349 1.581356
H  4.43146 1.472663 0.166351
H  7.027322 0.124836 1.147822
H  6.912344 1.134448 -0.30838
H  2.805244 -0.287651 -0.807644
H  1.784069 0.371614 1.878357
H  1.992605 1.720541 0.718745
H  -0.456921 0.633721 1.812332
H  8.939994 -0.366466 -0.434554
H  7.902556 -1.810626 -0.252552
H  7.778744 -0.802796 -1.721176
H  -4.947129 1.789114 0.414182
H  -4.001814 -2.163986 -1.12202
H  -2.165541 2.305921 2.374831
H  -1.563747 2.90114 0.805582
H  -3.256313 3.201733 1.293841
H  -0.679961 -2.023313 -1.280785
H  -0.725986 -2.403781 0.448238
H  -1.903903 -3.181828 -0.655887
